program: Gaussian 09
title: 000097786
version: EM64L-G09RevD.01
frameworkgroup: C1[X(C16H12O6)]
method: RPBEPBE
basis: SDD
operation: Freq
keyword: #pfreq=noraman
keyword: PBEPBE/SDD
title: #p freq=noraman PBEPBE/SDD
converged: YES YES NO NO
title: Mulliken charges:
elementType: O O O O O O C C C C C C C C C C C C C C C C H H H H H H H H H H H H
charge: -0.267605 -0.261759 -0.261731 -0.249283 -0.443180 -0.250313 -0.370265 0.641388 0.391693 0.040174 -0.569000 0.197271 0.157482 -0.379275 0.189238 -0.463753 0.166469 -0.327178 -0.362531 -0.327313 -0.203378 -0.203875 0.237380 0.260199 0.257943 0.270100 0.251694 0.284132 0.260347 0.235416 0.240980 0.244729 0.245869 0.367933
chargesum: 0.00000
title: Mulliken charges with hydrogens summed into heavy atoms:
elementType: O O O O O O C C C C C C C C C C C C C C C C
charge: -0.267605 -0.261759 -0.261731 -0.249283 -0.075247 -0.250313 -0.132884 0.641388 0.391693 0.040174 -0.308801 0.197271 0.157482 -0.121332 0.189238 -0.193653 0.166469 -0.075483 -0.078399 -0.066966 0.273018 0.286723
polarizability: 2.35381786e+02 -1.52539684e+00 2.24762068e+02 -7.44162806e+00 1.70697027e+01 1.38084191e+02
1716.lowfreq: -33.2114 -7.1633 -2.1103 -0.0005 0.0004 0.0005 5.0699 19.6351 22.3884
frequency: -32.4786 19.4735 22.2780 32.5652 67.5521 82.6386 106.6222 112.4449 148.3335 179.4093 215.4216 223.6600 252.9962 288.6431 298.8936 335.6823 372.1986 390.5919 400.1515 411.2283 426.1362 464.4890 495.0317 517.1194 564.2544 567.1173 601.1011 639.1585 655.7441 675.0624 678.9415 691.7733 725.3492 730.3390 765.5908 780.0090 783.6872 807.5160 823.6131 833.3823 838.3577 841.5433 865.2256 875.3848 882.4197 909.0578 945.7023 960.8636 972.7752 973.7100 979.5784 1019.6696 1058.2195 1063.0828 1065.0826 1068.7400 1120.4955 1125.1547 1133.5525 1140.1384 1169.9052 1199.7607 1222.9085 1245.1594 1265.4713 1267.0819 1282.2631 1293.4107 1361.3594 1363.3207 1372.2837 1393.5636 1406.0782 1440.3927 1450.7441 1473.4532 1474.7731 1485.0555 1485.9448 1550.7269 1600.3492 1608.7852 1623.4913 1626.5185 3001.0201 3003.1395 3021.8541 3104.3746 3105.5364 3145.0224 3154.5954 3163.8764 3181.2827 3187.2482 3192.1105 3383.6470
redmass: 2.2376 5.3806 8.0150 5.3098 2.7408 7.5375 8.5318 7.1822 7.4729 6.7980 6.0084 6.4603 8.0527 8.1834 7.9522 6.4318 6.6768 6.4336 5.3922 2.9392 3.0898 3.5785 1.3336 6.6164 5.4143 6.2547 5.7030 5.4014 6.4817 8.0847 9.0686 8.3827 4.2969 3.8245 6.2426 6.3036 5.0018 3.3076 1.6379 4.6435 3.1977 2.0525 2.6640 1.5801 2.9919 3.8527 1.3620 5.2491 1.4574 4.5283 4.3317 3.3695 3.4868 1.4601 3.8300 1.4944 1.0379 1.0713 1.4527 1.3001 1.6498 1.4519 1.8835 5.4291 1.7647 1.4064 2.8745 1.5558 1.5113 1.2659 1.6288 2.2214 3.5828 4.1834 4.6472 2.0517 1.8771 1.3875 1.5456 8.0086 7.8379 7.7295 8.4046 8.1347 1.0836 1.0598 1.0538 1.1189 1.1120 1.0899 1.0929 1.0894 1.0957 1.0962 1.0932 1.0638
irintensity: 13.0061 0.2552 0.5595 0.1980 11.3520 4.4898 1.1489 1.3060 1.5343 3.8529 0.1783 1.0547 4.3563 0.4673 0.0566 20.1335 5.4206 33.1714 8.3617 12.8217 12.9266 10.7692 102.2549 20.3415 1.3411 9.4373 8.3090 20.8749 2.2565 6.7559 0.8494 10.9606 2.5052 16.7758 12.4568 16.4356 17.0033 27.3036 30.3154 40.1090 3.8460 25.2604 19.5330 22.6221 47.1264 5.6688 0.1228 216.1778 7.8786 111.2891 91.0026 60.4922 20.9455 4.7917 44.7950 6.0059 0.1293 0.5650 17.7793 6.4326 11.0755 16.8553 39.6546 290.6906 149.5698 2.6029 534.7323 6.5948 22.2916 1.3043 32.0615 26.5487 5.9476 37.3225 47.6427 99.2611 113.9756 36.1156 80.6678 152.2356 8.3475 6.3760 31.9458 3.3934 38.3152 128.2198 106.9912 25.1047 28.4546 2.3322 2.6294 0.0976 3.8656 3.6117 2.6566 63.5879
temp: 298.150 k
press: 1.00000 atm
elementType: 8 8 8 8 8 8 6 6 6 6 6 6 6 6 6 6 6 6 6 6 6 6 1 1 1 1 1 1 1 1 1 1 1 1
symmnumber: 1
zpe: 647966.0 jmol-1
zpe.correction: 0.246797 hartree
zpe.thermalcorrener: 0.264401 hartree
zpe.thermalcorrenthalpy: 0.265345 hartree
zpe.thermalcorrgfe: 0.198612 hartree
zpe.sumelectzpe: -1066.622078 hartree
zpe.sumelectthermal: -1066.604474 hartree
zpe.sumelectthermalent: -1066.603530 hartree
zpe.sumelectthermalfe: -1066.670263 hartree
dipole: -2.0742 -4.7153 0.8662
dipole: 5.2237
quadrupole: -110.6008 -126.5298 -127.8298
quadrupole: -1.2870 2.5744 6.3976
quadrupole: 11.0527 -4.8764 -6.1763 -1.2870 2.5744 6.3976
hfenergy: -1066.8688749 hartree
pointgroup: C01 [X(C16H12O6)]
dipole: -0.869242 1.8366285 -0.3079674 debye
polarizability: 234.5607001|0.8248057|223.4850793|10.6890177|20.5272249|140.1822658 unknown
InChI: InChI=1S/C16H12O6/c17-15(9-1-3-11-13(5-9)21-7-19-11)16(18)10-2-4-12-14(6-10)22-8-20-12/h1-6,15,17H,7-8H2
charge 0 multiplicity 1
34 atoms
O  3.506942 2.157089 1.220835
O  4.332293 1.819491 -1.007993
O  -2.878801 2.233321 0.895275
O  -4.672545 1.688142 -0.606469
O  1.223002 -3.259296 1.323116
O  -0.661586 -3.346277 -0.504339
C  0.573169 -1.981943 1.05459
C  1.555175 -0.971543 0.450107
C  -1.677971 -1.195206 -0.098788
C  -0.627798 -2.224462 0.098992
C  2.001839 0.130283 1.233937
C  2.934439 0.990514 0.652833
C  3.421196 0.791518 -0.656346
C  2.049847 -1.167345 -0.864072
C  -2.688569 0.944348 0.339739
C  -1.641544 0.063152 0.585815
C  -3.748817 0.629513 -0.542211
C  2.996159 -0.281761 -1.443615
C  -2.75165 -1.502254 -0.983022
C  -3.807996 -0.5935 -1.221085
C  4.535084 2.601482 0.241437
C  -4.124706 2.75826 0.280549
H  0.201173 -1.598781 2.024899
H  1.651146 0.284144 2.259338
H  1.703004 -2.027961 -1.445801
H  -0.82704 0.338603 1.257933
H  3.377752 -0.430146 -2.456816
H  -2.738143 -2.476989 -1.479656
H  -4.632107 -0.828894 -1.898373
H  5.53944 2.377692 0.647031
H  4.384699 3.670312 0.024153
H  -3.883357 3.640294 -0.336952
H  -4.859817 2.971136 1.073986
H  0.881987 -3.893434 0.625771
