program: Gaussian 09
title: 000097704
version: EM64L-G09RevD.01
frameworkgroup: C1[X(C6H10N2O2)]
method: RPBEPBE
basis: SDD
operation: Freq
keyword: #p
keyword: freq=noraman
keyword: PBEPBE/SDD
title: #p freq=noraman PBEPBE/SDD
converged: YES YES NO NO
title: Mulliken charges:
elementType: O O N N C C C C C C H H H H H H H H H H
charge: -0.264777 -0.264756 -0.368684 -0.368669 -0.136489 -0.136554 0.183193 0.183183 -0.707976 -0.708002 0.253490 0.253565 0.331794 0.331795 0.232301 0.232283 0.266297 0.210856 0.210831 0.266320
chargesum: 0.00000
title: Mulliken charges with hydrogens summed into heavy atoms:
elementType: O O N N C C C C C C
charge: -0.264777 -0.264756 -0.036890 -0.036874 0.117001 0.117011 0.183193 0.183183 0.001452 0.001457
polarizability: 1.08571871e+02 8.86868338e-01 8.00581685e+01 3.28095401e-03 3.81696440e-03 5.58224087e+01
1716.lowfreq: -12.5784 -8.8380 -0.0012 -0.0009 -0.0008 1.9408 34.7273 120.9888 123.2437
frequency: 34.7080 120.9883 123.2399 200.3866 203.7655 265.8660 281.5178 338.6336 363.6736 389.6317 439.3115 472.6794 570.3788 597.5376 606.6131 662.7762 679.6345 742.0893 756.8376 806.8994 938.6049 974.8637 1031.0845 1048.5155 1094.5623 1116.9778 1152.4428 1179.9844 1261.1246 1281.2590 1294.6220 1298.4841 1342.9672 1357.9095 1391.3325 1392.0774 1413.0570 1424.0301 1466.4101 1467.3306 1478.1492 1479.0165 1635.9064 1636.4997 2923.4662 2924.8509 2997.6704 2997.7922 3093.6674 3093.7737 3121.8764 3121.8862 3519.2629 3521.2068
redmass: 3.8309 5.9678 4.1392 1.0495 1.0777 2.6112 3.2342 5.7374 2.8397 4.3909 4.3118 8.1634 3.8924 2.2262 1.5442 2.4440 2.0107 4.1449 3.0629 2.8384 1.8832 1.6606 1.8465 1.5733 2.6984 2.8808 2.1369 2.1696 1.6327 1.4347 1.3988 1.2783 1.9104 5.4725 1.3291 1.2458 1.5018 2.1450 1.0482 1.0489 1.0627 1.0688 6.7395 6.4589 1.0818 1.0819 1.0369 1.0369 1.1007 1.1007 1.0988 1.0989 1.0764 1.0768
irintensity: 4.1303 2.8667 0.0470 0.1270 0.0400 3.3465 0.1276 21.4708 1.7715 0.1724 9.5326 0.4898 0.8821 76.5447 1.9435 29.6847 135.4491 8.4655 15.7968 5.5381 9.5424 1.2507 6.9077 0.3967 4.0364 14.2145 27.0887 6.6048 0.2822 24.5703 116.8327 0.0135 0.5006 189.8882 5.9249 58.0372 22.7597 1.4891 14.3946 13.5266 17.9388 4.3544 14.0322 619.6590 49.8826 12.5732 45.3415 1.7669 18.1596 29.8088 9.5539 8.8260 39.5096 2.2527
temp: 298.150 k
press: 1.00000 atm
elementType: 8 8 7 7 6 6 6 6 6 6 1 1 1 1 1 1 1 1 1 1
symmnumber: 1
zpe: 425450.9 jmol-1
zpe.correction: 0.162046 hartree
zpe.thermalcorrener: 0.172083 hartree
zpe.thermalcorrenthalpy: 0.173028 hartree
zpe.thermalcorrgfe: 0.126472 hartree
zpe.sumelectzpe: -493.843595 hartree
zpe.sumelectthermal: -493.833557 hartree
zpe.sumelectthermalent: -493.832613 hartree
zpe.sumelectthermalfe: -493.879168 hartree
dipole: 0.0003 -0.0009 1.4462
dipole: 1.4462
quadrupole: -68.1584 -61.3730 -58.1818
quadrupole: -18.1676 -0.0047 -0.0032
quadrupole: -5.5873 1.1981 4.3893 -18.1676 -0.0047 -0.0032
hfenergy: -494.0056406 hartree
pointgroup: C01 [X(C6H10N2O2)]
dipole: -0.0000782 -0.0003452 -0.5689705 debye
dipolederiv: -1.0931234 0.1141472 0.0729476 0.3940267 -0.6892689 -0.0691071 0.1631893 -0.059733 -0.3793169 -1.0930465 0.1142259 -0.0727252 0.3936731 -0.6891815 0.0689582 -0.1642194 0.0600552 -0.3793476 -1.1908709 -0.0306409 0.065084 -0.3510757 -0.3600628 0.0731825 -0.1370049 0.0130054 -0.4339465 -1.1907219 -0.0305265 -0.0653197 -0.3509773 -0.360071 -0.0732448 0.1372031 -0.013125 -0.4338999 0.478521 -0.0949786 -0.1307828 -0.1888059 -0.0364554 0.1014086 -0.067329 0.1327399 0.3776996 0.4784306 -0.0951932 0.1306505 -0.1888376 -0.0361689 -0.1013284 0.0673266 -0.1329852 0.3775177 1.626615 -0.0846428 -0.1353515 0.048353 0.8549483 0.1199416 -0.1144653 0.1567841 0.185954 1.6264931 -0.0847048 0.1354163 0.0485364 0.8549741 -0.1198948 0.1152381 -0.156836 0.1859988 -0.0852218 0.049657 -0.0169211 0.0110711 0.0572295 -0.0424021 -0.0049557 -0.0356087 0.0471644 -0.0852198 0.0496616 0.016932 0.0111439 0.0571877 0.042424 0.0049287 0.0355711 0.0472077 -0.0358932 0.0225289 -0.0081948 0.0488343 0.0271192 -0.0182034 0.0714211 -0.0230709 -0.1451093 -0.0358039 0.0225044 0.008201 0.048823 0.0270426 0.0182438 -0.0714001 0.0231075 -0.1449663 0.1375505 0.0003566 0.0236471 0.0207859 0.1100053 -0.0396894 0.0448462 -0.0349815 0.3136515 0.1375335 0.0003304 -0.0235928 0.0208121 0.1099916 0.0397219 -0.0447989 0.0351091 0.3136138 0.0891767 -0.0124743 0.0502377 -0.0242885 0.0892377 0.0028179 -0.0027473 -0.0328709 -0.117124 0.0891939 -0.0124425 -0.0502739 -0.0243096 0.0892368 -0.0027669 0.002743 0.0329237 -0.1171468 -0.0179024 0.0465521 0.033217 0.1117067 0.091113 -0.0309236 0.0329554 -0.0319249 0.096262 0.0910818 -0.0104703 0.0151111 -0.070597 -0.1439703 -0.0667656 0.0092896 -0.085058 0.0547224 0.091075 -0.0104494 -0.0151031 -0.0705804 -0.1440214 0.0667367 -0.0093001 0.0850105 0.054752 -0.0178673 0.0465592 -0.0331796 0.1117059 0.0911143 0.0308909 -0.0329206 0.0318875 0.0963134 unknown
polarizability: 108.5317381|1.38898|80.0983015|0.0035746|-0.0035434|55.8224087 unknown
InChI: InChI=1S/C6H10N2O2/c1-3-5(9)8-4(2)6(10)7-3/h3-4,7-8H,1-2H3
charge 0 multiplicity 1
20 atoms
O  -2.244287 1.542678 0.117184
O  2.244226 -1.542299 0.118026
N  0.064149 1.366914 -0.098542
N  -0.064178 -1.366869 -0.098643
C  1.296234 0.650157 -0.499731
C  -1.296317 -0.650085 -0.499561
C  -1.213235 0.848244 -0.123591
C  1.21324 -0.848309 -0.124313
C  2.534144 1.308265 0.132548
C  -2.534174 -1.308333 0.132675
H  1.405521 0.685952 -1.607647
H  -1.405655 -0.685692 -1.607486
H  0.143727 2.362273 0.129669
H  -0.143762 -2.362176 0.12979
H  2.43829 1.341676 1.231542
H  -2.438201 -1.342012 1.231648
H  3.426872 0.711646 -0.111332
H  -2.672981 -2.335603 -0.250701
H  2.672921 2.335631 -0.250583
H  -3.426932 -0.711657 -0.110952
