program: Gaussian 09
title: 000097697
version: EM64L-G09RevD.01
frameworkgroup: C1[X(C4H10N2)]
method: RPBEPBE
basis: SDD
operation: Freq
keyword: #pfreq=noraman
keyword: PBEPBE/SDD
title: #p freq=noraman PBEPBE/SDD
converged: YES YES NO NO
title: Mulliken charges:
elementType: N N C C C C H H H H H H H H H H
charge: -0.104851 -0.578551 -0.410000 -0.420946 -0.361982 -0.388629 0.236924 0.213006 0.215827 0.236871 0.214161 0.191673 0.209330 0.208038 0.261599 0.277532
chargesum: 0.00000
title: Mulliken charges with hydrogens summed into heavy atoms:
elementType: N N C C C C
charge: -0.104851 -0.039420 0.039929 0.031752 0.043852 0.028738
polarizability: 6.80155608e+01 -8.54027112e-02 5.52421245e+01 -1.09853719e+00 5.46637007e-01 4.50881748e+01
1716.lowfreq: -11.7162 0.0003 0.0006 0.0012 3.1214 16.3033 92.9091 105.0372 174.8668
frequency: 92.2268 104.8072 174.8585 220.1266 340.9899 390.0579 433.6878 610.5919 723.7158 791.0764 816.5082 821.8616 943.6696 985.0291 998.5819 1056.5280 1066.1454 1076.1622 1105.6296 1122.7054 1138.3936 1181.0070 1249.0047 1259.2282 1286.3104 1329.6595 1388.9273 1453.3639 1462.3195 1476.6425 1490.2238 1640.7826 2900.5043 2919.0526 3005.4303 3034.3502 3049.1142 3058.9930 3159.7219 3177.4568 3459.7543 3586.6516
redmass: 2.9127 2.0848 2.4530 1.1472 2.3926 2.6711 3.5521 1.2856 2.8464 1.4070 1.3987 2.3239 1.5581 1.2286 1.6499 1.8153 1.5881 1.3212 2.4589 1.6420 1.5190 1.5252 1.2954 3.3789 1.1458 1.2965 1.4666 1.0802 1.1086 1.1426 1.0850 1.0929 1.0673 1.0680 1.0904 1.0953 1.0507 1.0623 1.1141 1.1151 1.0451 1.0974
irintensity: 2.3500 8.6788 2.1828 53.1244 5.8549 8.5903 0.6176 243.0563 8.1797 4.5854 1.1728 3.8605 2.0352 4.7382 33.5830 13.0726 5.1484 13.9916 6.0490 9.4516 1.5396 3.1769 3.1728 28.2785 1.1575 5.4103 1.5677 4.8362 1.3778 5.2093 5.0702 38.6071 18.1682 138.7679 9.5611 64.1113 43.1856 32.9060 2.2511 46.5608 1.0356 0.5777
temp: 298.150 k
press: 1.00000 atm
elementType: 7 7 6 6 6 6 1 1 1 1 1 1 1 1 1 1
symmnumber: 1
zpe: 368341.3 jmol-1
zpe.correction: 0.140294 hartree
zpe.thermalcorrener: 0.147561 hartree
zpe.thermalcorrenthalpy: 0.148505 hartree
zpe.thermalcorrgfe: 0.109214 hartree
zpe.sumelectzpe: -267.348610 hartree
zpe.sumelectthermal: -267.341343 hartree
zpe.sumelectthermalent: -267.340398 hartree
zpe.sumelectthermalfe: -267.379690 hartree
dipole: -0.5464 0.1254 0.4200
dipole: 0.7005
quadrupole: -32.0645 -35.2674 -41.9185
quadrupole: -0.5428 4.0803 0.8119
quadrupole: 4.3523 1.1494 -5.5017 -0.5428 4.0803 0.8119
hfenergy: -267.488904 hartree
pointgroup: C01 [X(C4H10N2)]
dipole: -0.2175917 0.0656048 0.1559087 debye
dipolederiv: -0.7228874 -0.1424019 -0.0724884 -0.1530391 -0.0963034 -0.0320264 -0.1127055 -0.0334796 -0.3873045 -0.6513568 -0.0389577 0.0587881 -0.0195627 -0.210002 0.1056327 0.1207636 0.0770296 -0.7435756 0.1513919 0.0044264 -0.063461 0.0363055 -0.0201678 0.0260833 -0.0480671 0.0100492 0.208169 0.119427 0.0765417 -0.0369609 0.0698212 0.0002147 -0.0596286 -0.0245509 -0.0533902 0.1890427 0.4396259 0.1145294 -0.0499188 0.1550101 0.1891882 0.0475179 -0.0967486 0.0292372 0.2609067 0.4998383 0.0779562 -0.1719396 0.0626746 0.161564 -0.0341843 -0.0185578 0.0216002 0.4036928 -0.0940152 0.0856954 0.0663282 0.099312 0.0548432 -0.0004032 0.0936547 -0.0205214 0.02848 0.0308464 0.0115585 0.0512797 0.0333783 0.0307308 0.1006338 -0.0403066 0.1316054 -0.0981956 0.0583803 0.0095369 0.106051 -0.0128863 0.0078563 -0.0523747 0.0539936 -0.1153724 -0.0901024 0.0507703 -0.0728647 0.0532049 -0.1065419 -0.0695372 0.0414217 0.0679448 0.0719447 0.0303843 -0.0101925 -0.0563634 -0.0029664 -0.0848861 -0.1681566 -0.0416573 -0.0025771 -0.0567319 0.0606792 -0.0351546 -0.0162819 -0.0397671 -0.0045632 0.0520797 -0.0129549 0.0568638 0.0442001 -0.2462554 0.0355948 -0.0514401 0.015267 -0.0507493 -0.1535468 -0.0376264 0.0100473 -0.0723916 0.0486396 -0.0274474 -0.0174529 0.0494439 -0.0104307 0.0547599 0.0032925 0.049976 0.0455066 -0.2740699 0.1425811 -0.0500976 0.0338778 -0.079036 0.0620518 -0.0912975 -0.0133592 -0.1562213 0.2716635 0.012598 0.0656155 0.0032618 0.0651935 0.1044253 0.0375712 -0.0963711 0.0769354 0.3378457 unknown
polarizability: 68.0437159|-0.1261383|55.240363|-0.7495033|-0.5539305|45.0617811 unknown
InChI: InChI=1S/C4H10N2/c5-1-2-6-3-4-6/h1-5H2
charge 0 multiplicity 1
16 atoms
N  0.900297 -0.199043 -0.525567
N  -2.798847 -0.114929 0.263362
C  2.15949 -0.58583 0.207321
C  1.692304 0.862878 0.19964
C  -0.376695 -0.599668 0.129362
C  -1.526177 0.300924 -0.362236
H  2.996301 -0.898189 -0.425287
H  2.061422 -1.137417 1.15338
H  1.283059 1.261363 1.139365
H  2.190292 1.599349 -0.438775
H  -0.578513 -1.651318 -0.156446
H  -0.340324 -0.553501 1.244047
H  -1.317567 1.344332 -0.05839
H  -1.529033 0.28225 -1.476486
H  -3.123978 -1.041144 -0.032115
H  -3.545333 0.583644 0.209425
