program: Gaussian 09
title: 000097717
version: EM64L-G09RevD.01
frameworkgroup: C1[X(C12H10ClNOS2)]
method: RPBEPBE
basis: SDD
operation: Freq
keyword: #p
keyword: freq=noraman
keyword: PBEPBE/SDD
title: #p freq=noraman PBEPBE/SDD
converged: YES YES NO NO
title: Mulliken charges:
elementType: Cl S S O N C C C C C C C C C C C C H H H H H H H H H H
charge: -0.034205 0.244138 0.126656 -0.224182 -0.087592 -0.330052 -0.281231 0.307481 -0.516598 -0.242349 -0.654672 0.498403 -0.381536 -0.340977 -0.221136 -0.226370 -0.113611 0.245289 0.249895 0.265623 0.238450 0.239268 0.226712 0.243424 0.245507 0.262132 0.261533
chargesum: 0.00000
title: Mulliken charges with hydrogens summed into heavy atoms:
elementType: Cl S S O N C C C C C C C C C C C C
charge: -0.034205 0.244138 0.126656 -0.224182 -0.087592 0.165132 -0.281231 0.307481 -0.516598 0.023274 0.049758 0.498403 -0.138112 -0.095470 0.040996 0.035163 -0.113611
polarizability: 4.17586480e+02 -2.62586474e+01 1.95668192e+02 -4.06982942e+00 -4.30468342e+00 7.76532903e+01
1716.lowfreq: -11.5708 -3.4628 -0.0015 -0.0013 -0.0012 4.7288 28.1086 34.6007 49.0678
frequency: 28.0585 34.4869 48.9383 65.8326 75.7991 87.1093 155.8934 176.7757 177.5189 198.7263 213.4403 259.8926 308.8721 317.7291 334.1627 377.3484 397.3896 403.5906 409.2678 447.8111 487.3068 523.7611 524.5798 559.1262 609.4918 627.4613 662.8749 701.7499 709.8508 727.1377 785.6155 806.2790 817.5909 828.9887 878.4021 933.9380 954.9980 965.2534 970.9313 987.3707 995.8713 1074.3602 1083.4784 1101.5555 1120.5584 1132.8852 1196.9042 1219.7621 1254.5476 1294.6626 1301.0842 1321.4661 1343.6891 1375.4427 1382.9822 1388.3118 1407.4081 1451.2532 1470.9816 1479.3086 1481.3495 1565.7973 1589.7787 1605.8109 1624.6453 2996.0628 3030.0075 3088.5865 3091.1172 3096.0319 3112.4043 3137.4841 3155.8291 3174.7089 3178.0978
redmass: 5.4227 4.3304 3.1543 8.9160 8.5945 9.8624 5.4461 6.4134 6.8344 3.6321 1.5421 5.8299 4.1348 6.4201 3.2541 5.5386 12.8345 3.0822 11.3874 4.4330 5.7654 17.7486 2.6497 6.8681 6.6200 6.6334 7.0299 3.8884 3.8093 5.4787 1.6081 3.3854 1.3233 1.4671 3.7883 1.3827 1.4145 4.8140 1.4193 2.8439 4.0093 3.2140 2.9461 2.4838 1.7336 1.8378 1.1471 2.7701 2.5167 2.2338 1.5709 1.7045 1.4293 1.9380 2.8802 1.2119 3.3874 1.1285 1.0424 2.3549 1.0544 6.9891 6.8943 8.1800 8.3176 1.0353 1.0592 1.1032 1.0873 1.0990 1.1045 1.0902 1.0882 1.0955 1.0970
irintensity: 0.0220 0.1782 0.1649 0.2559 1.6553 2.1326 1.4884 0.5744 0.6052 0.2096 1.2240 4.0160 1.1012 0.7690 4.6764 17.0555 18.3792 2.8508 26.1308 5.1364 24.1089 3.8119 32.2418 5.0879 7.3526 16.3119 3.0685 5.2816 10.5776 1.5982 12.2603 63.2488 7.8405 51.6463 7.1630 17.5610 1.1733 31.9902 4.4428 3.2723 44.0057 123.7554 2.1026 6.9606 53.1958 172.5912 20.0524 290.7508 132.6621 126.6366 13.0315 2.1490 93.4409 84.0775 32.2730 18.1061 18.0391 63.9245 12.9101 116.8117 12.4952 1.0694 326.0650 97.0156 41.8117 22.3003 16.5912 2.1681 2.0575 35.0732 9.1743 4.7606 4.0449 4.7183 1.4655
temp: 298.150 k
press: 1.00000 atm
elementType: 17 16 16 8 7 6 6 6 6 6 6 6 6 6 6 6 6 1 1 1 1 1 1 1 1 1 1
symmnumber: 1
zpe: 501866.8 jmol-1
zpe.correction: 0.191151 hartree
zpe.thermalcorrener: 0.207494 hartree
zpe.thermalcorrenthalpy: 0.208438 hartree
zpe.thermalcorrgfe: 0.144711 hartree
zpe.sumelectzpe: -1848.241035 hartree
zpe.sumelectthermal: -1848.224692 hartree
zpe.sumelectthermalent: -1848.223748 hartree
zpe.sumelectthermalfe: -1848.287475 hartree
dipole: -0.6394 1.5806 0.1732
dipole: 1.7138
quadrupole: -119.2767 -124.6483 -123.5118
quadrupole: 2.3596 1.0145 -0.1854
quadrupole: 3.2023 -2.1694 -1.0329 2.3596 1.0145 -0.1854
hfenergy: -1848.4321864 hartree
pointgroup: C01 [X(C12H10Cl1N1O1S2)]
dipole: -0.1957928 0.5782535 -0.2861746 debye
polarizability: 411.1513901|-37.9957335|162.7613102|25.2730554|-58.1134949|116.9952614 unknown
InChI: InChI=1S/C12H10ClNOS2/c1-2-14-11(15)10(17-12(14)16)7-8-3-5-9(13)6-4-8/h3-7H,2H2,1H3
charge 0 multiplicity 1
27 atoms
Cl -6.323812 -0.28208 0.342324
S  0.964605 -1.448812 0.97337
S  3.816466 -2.483316 1.606753
O  2.3645 1.556785 -1.178342
N  3.168746 -0.277719 0.074742
C  4.588209 0.081016 -0.182122
C  0.789786 0.035729 -0.069024
C  2.129882 0.545002 -0.463893
C  2.807868 -1.366563 0.856242
C  -0.351238 0.671611 -0.491286
C  5.155304 0.995464 0.92028
C  -1.761564 0.385658 -0.252025
C  -2.72161 1.250142 -0.863539
C  -2.248671 -0.692669 0.548825
C  -4.104431 1.057789 -0.691877
C  -3.629653 -0.896511 0.73027
C  -4.541169 -0.018524 0.107502
H  5.156656 -0.862244 -0.242601
H  4.60505 0.590693 -1.160365
H  -0.140579 1.550181 -1.120675
H  4.586735 1.939093 0.980083
H  5.12753 0.492697 1.902035
H  6.206797 1.241883 0.688728
H  -2.37228 2.084612 -1.482588
H  -1.557929 -1.38365 1.040317
H  -4.82782 1.726361 -1.166409
H  -3.99398 -1.723826 1.345675
