program: Gaussian 09
title: 000097718
version: EM64L-G09RevD.01
frameworkgroup: C1[X(C15H10Cl2N2O2)]
method: RPBEPBE
basis: SDD
operation: Freq
keyword: #p
keyword: freq=noraman
keyword: PBEPBE/SDD
title: #p freq=noraman PBEPBE/SDD
converged: YES YES NO NO
title: Mulliken charges:
elementType: Cl Cl O O N N C C C C C C C C C C C C C C C H H H H H H H H H H
charge: -0.045807 -0.041269 -0.195176 -0.216613 -0.441504 -0.398700 -0.049761 0.414477 0.469246 0.131005 0.157682 -0.321655 -0.378075 -0.400686 -0.379118 -0.215509 -0.214495 -0.204196 -0.212233 -0.123188 -0.124658 0.339901 0.355150 0.271982 0.264802 0.265064 0.253505 0.259666 0.260662 0.259088 0.260412
chargesum: 0.00000
title: Mulliken charges with hydrogens summed into heavy atoms:
elementType: Cl Cl O O N N C C C C C C C C C C C C C C C
charge: -0.045807 -0.041269 -0.195176 -0.216613 -0.101603 -0.043550 -0.049761 0.414477 0.469246 0.131005 0.157682 -0.049673 -0.113273 -0.135622 -0.125613 0.044157 0.046167 0.054892 0.048179 -0.123188 -0.124658
polarizability: 2.45638290e+02 4.01888941e+00 2.03148531e+02 1.62298724e+01 -6.02086927e+00 1.42928361e+02
1716.lowfreq: -1.2248 -0.0021 -0.0011 -0.0011 6.4525 9.0963 23.0427 29.4090 43.0373
frequency: 22.8328 29.3539 43.0339 50.5672 63.7831 104.2213 133.5670 141.6889 161.5801 206.8585 220.8566 221.3784 284.2933 313.5405 324.3631 339.9843 360.2574 401.1379 404.8242 409.7906 432.3493 465.1671 493.9249 504.2683 526.8794 601.4096 613.5388 619.3520 624.1428 630.9466 667.1817 696.8106 705.9752 718.2263 721.6490 735.0984 743.9643 828.8768 830.3152 835.3018 837.7892 909.5669 942.8373 953.2861 962.2921 970.0813 973.6070 980.2094 1000.8430 1001.9877 1073.4344 1076.1576 1077.7533 1116.3323 1118.7412 1179.0701 1188.8289 1192.3462 1195.0372 1216.2611 1294.1109 1301.4202 1306.7212 1317.4471 1350.6128 1365.8714 1371.4938 1391.6931 1396.0798 1474.1243 1478.4639 1582.2823 1586.1968 1597.0089 1598.9743 1681.1295 1722.7738 3138.7679 3149.7843 3150.4875 3153.0997 3172.1501 3172.9247 3176.3153 3176.6190 3584.3457 3596.5081
redmass: 4.1776 8.8459 9.7605 5.1759 9.3799 8.8820 8.9248 8.2884 7.8658 11.7010 9.3154 10.7212 8.5860 6.2750 6.6998 5.2687 5.9677 6.2317 2.9641 2.9821 7.0292 7.1119 1.3814 3.3864 2.5075 8.7388 3.1689 5.7826 6.9022 3.8378 1.7821 6.3146 6.3129 4.8583 4.9699 5.2327 3.9944 1.3908 1.4556 1.3582 1.4014 6.4870 2.8887 1.4002 1.9497 1.3883 1.4871 2.4154 4.0726 4.0563 3.6178 2.8633 2.6650 1.4101 1.4526 2.1028 1.4710 3.2018 1.3060 4.2709 1.2572 1.2692 4.1700 2.1156 1.8083 4.7465 6.4468 3.6172 3.2002 2.3345 2.3198 7.5793 7.7939 6.1711 6.1750 8.7680 9.5249 1.0896 1.0893 1.0883 1.0892 1.0954 1.0960 1.0966 1.0972 1.0802 1.0802
irintensity: 0.0208 0.0704 0.1778 0.0861 0.5831 0.7940 0.6444 0.6350 2.5458 0.3056 1.6952 1.3568 0.6627 2.3014 4.8372 3.0804 3.0893 12.0191 0.7385 1.2381 11.7569 16.9041 84.6994 41.5352 75.5401 10.1305 37.5936 12.5316 1.9611 32.7317 56.3656 5.8866 3.9440 19.8820 12.3454 63.0662 43.3886 25.1086 38.8785 15.0313 27.1397 37.7289 3.2894 2.8164 2.4851 0.2943 3.4703 29.4884 53.2462 33.1169 16.4218 49.2892 38.6465 2.6808 15.4216 3.4037 10.0480 60.7788 7.2973 51.4431 1.7270 0.2667 231.8435 31.4320 12.4385 3.1487 3.4266 12.5829 5.9833 84.8061 80.2056 2.6734 5.4335 21.5787 13.7822 476.6217 475.9044 4.5318 3.2880 1.3219 3.1048 3.0120 4.1149 0.7249 0.3192 90.7322 39.8509
temp: 298.150 k
press: 1.00000 atm
elementType: 17 17 8 8 7 7 6 6 6 6 6 6 6 6 6 6 6 6 6 6 6 1 1 1 1 1 1 1 1 1 1
symmnumber: 1
zpe: 571140.0 jmol-1
zpe.correction: 0.217536 hartree
zpe.thermalcorrener: 0.235466 hartree
zpe.thermalcorrenthalpy: 0.236410 hartree
zpe.thermalcorrgfe: 0.168961 hartree
zpe.sumelectzpe: -1756.249272 hartree
zpe.sumelectthermal: -1756.231342 hartree
zpe.sumelectthermalent: -1756.230398 hartree
zpe.sumelectthermalfe: -1756.297847 hartree
dipole: 0.4736 -0.6826 -0.9376
dipole: 1.2527
quadrupole: -145.1557 -145.0638 -135.7422
quadrupole: -0.2155 5.1791 8.2065
quadrupole: -3.1685 -3.0766 6.2451 -0.2155 5.1791 8.2065
hfenergy: -1756.4668077 hartree
pointgroup: C01 [X(C15H10Cl2N2O2)]
dipole: 0.1936304 -0.2532368 -0.3758788 debye
polarizability: 244.9114236|3.2759335|203.5307999|18.5623661|-3.4289096|143.2729583 unknown
InChI: InChI=1S/C15H10Cl2N2O2/c16-11-5-1-9(2-6-11)15(13(20)18-14(21)19-15)10-3-7-12(17)8-4-10/h1-8,18-19H
charge 0 multiplicity 1
31 atoms
Cl -5.185691 -2.585249 -0.258435
Cl 5.203729 -2.604725 -0.25075
O  -0.188461 1.242588 2.472412
O  0.125082 4.155796 -1.217808
N  0.111168 1.778709 -1.052068
N  -0.133705 2.956109 0.837464
C  0.015211 0.739457 0.000196
C  -1.278496 -0.09621 -0.105332
C  1.289406 -0.129571 0.016153
C  -0.110843 1.638028 1.288396
C  0.044871 3.082698 -0.579174
C  -1.478979 -1.172522 0.796901
C  1.381581 -1.241446 -0.859356
C  -2.292046 0.221908 -1.038659
C  2.411074 0.209687 0.81186
C  -2.666277 -1.931608 0.757825
C  2.569491 -1.997607 -0.950665
C  -3.485483 -0.534056 -1.093731
C  3.604408 -0.540821 0.738159
C  -3.652143 -1.602708 -0.19436
C  3.667291 -1.632891 -0.147659
H  0.384852 1.577564 -2.012775
H  -0.24655 3.770759 1.441763
H  -0.712079 -1.410378 1.540764
H  0.517894 -1.534124 -1.466717
H  -2.159777 1.066199 -1.722449
H  2.36374 1.051436 1.510087
H  -2.823217 -2.759482 1.454863
H  2.637501 -2.853985 -1.627382
H  -4.267758 -0.29073 -1.818222
H  4.466205 -0.282024 1.359599
