program: Gaussian 09
title: 000097714
version: EM64L-G09RevD.01
frameworkgroup: C1[X(C20H16O)]
method: RPBEPBE
basis: SDD
operation: Freq
keyword: #pfreq=noraman
keyword: PBEPBE/SDD
title: #p freq=noraman PBEPBE/SDD
converged: YES YES NO YES
title: Mulliken charges:
elementType: O C C C C C C C C C C C C C C C C C C C C H H H H H H H H H H H H H H H H
charge: -0.458220 0.031588 0.274889 -0.201909 -0.509751 -0.442573 -0.440683 0.305062 0.002212 0.522636 -0.682353 -0.006096 -0.454489 0.497510 0.480888 -0.503588 -0.512070 -0.486918 -0.473116 -0.468877 -0.246011 0.199790 0.223491 0.227170 0.194051 0.225490 0.208224 0.214538 0.280403 0.241313 0.244138 0.233220 0.235682 0.338297 0.241265 0.239806 0.224991
chargesum: 0.00000
title: Mulliken charges with hydrogens summed into heavy atoms:
elementType: O C C C C C C C C C C C C C C C C C C C C
charge: -0.119923 0.031588 0.274889 -0.002119 -0.059090 -0.023032 -0.017922 0.305062 0.002212 0.522636 -0.401950 -0.006096 -0.213176 0.497510 0.480888 -0.259451 -0.278849 -0.251237 -0.231851 -0.229071 -0.021019
polarizability: 3.76025529e+02 3.49739028e+00 2.39206240e+02 5.35992413e+00 3.20613392e+00 9.92551338e+01
1716.lowfreq: -6.2183 -3.4962 -0.0004 0.0003 0.0004 9.5246 52.9655 57.6009 114.1063
frequency: 52.9596 57.5829 114.0986 146.1764 174.7882 191.2224 220.2729 255.9894 260.6802 287.1003 294.2995 327.3061 340.4612 390.4991 412.4228 429.5488 452.8065 467.0116 483.6013 507.5714 512.4111 513.5599 525.2591 546.9233 568.9718 579.0540 626.9632 670.8947 695.9443 709.9314 740.2307 757.3399 767.5730 794.7968 816.4709 825.0502 834.9057 859.6144 866.9866 894.7847 908.9752 912.3161 924.0124 933.0000 973.7687 977.4302 983.3679 988.9415 1018.4768 1027.3837 1072.2815 1078.3402 1104.6059 1116.0805 1120.5624 1143.3537 1162.9986 1178.5752 1182.1314 1193.5271 1200.9514 1221.7213 1239.0797 1253.4591 1258.8856 1287.6203 1299.8754 1317.9074 1325.7369 1337.4953 1355.0857 1372.3459 1381.6496 1386.5014 1413.9716 1427.9179 1431.6417 1436.8093 1458.9096 1467.9888 1472.6772 1477.4196 1491.0005 1497.3767 1556.9175 1590.6936 1606.8328 1607.9780 1636.8548 2902.0904 2956.1228 2977.5743 2983.3080 3016.7053 3042.2742 3052.1760 3120.1621 3121.2987 3123.8703 3130.8561 3145.1917 3153.6435 3155.4553 3161.2138 3558.9445
redmass: 5.0131 4.1677 2.7576 4.8610 4.9030 3.7416 3.9153 2.2047 5.8954 1.3029 2.5708 3.1683 5.0051 3.9158 3.4062 4.5564 4.1889 5.6603 5.6606 3.4440 4.8479 3.7087 4.5671 3.0812 4.8548 3.8857 4.5371 3.4377 3.7509 3.5488 3.3035 3.8260 1.2649 4.8931 4.1800 1.4320 2.3631 2.2718 2.3232 2.3731 1.7002 1.8877 2.4156 1.6635 1.3475 5.4487 1.3906 1.4128 3.1382 4.1079 2.0253 1.9286 2.0130 1.9100 2.1843 1.3670 1.2942 1.2955 1.2811 1.2580 1.7008 1.5387 1.5346 1.3803 1.6273 2.0884 1.2582 1.6437 2.5129 1.6318 1.5556 2.1400 2.5906 2.4380 2.5861 4.9437 5.6707 2.4213 1.4366 2.5796 1.1637 1.1231 6.0022 3.2239 5.2299 7.4472 6.5285 6.7747 7.5241 1.0823 1.0645 1.0635 1.0626 1.0936 1.0994 1.1022 1.0861 1.0859 1.0878 1.0916 1.0983 1.0913 1.0989 1.0944 1.0660
irintensity: 0.3436 1.9980 0.5417 1.0955 3.3787 3.1802 7.2706 0.4350 2.3432 98.2288 26.0844 11.2317 6.7587 8.1685 3.7149 2.4879 0.1457 2.8242 2.9104 1.8850 1.3403 0.3053 0.2414 1.4782 0.2679 5.3943 1.4488 7.7624 1.8131 9.8189 22.5673 10.1583 6.9679 8.1337 0.8533 0.9015 24.2838 31.4949 45.7792 20.7592 19.4098 2.2303 6.2733 25.0367 1.6124 11.7233 3.6353 0.5734 22.7554 44.1336 4.5758 2.3484 4.7643 13.6232 3.8341 1.4922 16.9401 14.7624 17.3720 15.1195 18.3552 3.3863 0.1216 13.1501 1.3647 13.2481 1.7951 0.8814 0.9010 4.8242 4.4173 4.6712 12.3163 8.8164 6.1040 1.8680 0.9970 7.9197 13.1092 2.3866 8.0095 10.7228 9.5483 1.2258 0.7424 5.0871 3.0529 11.4656 0.1128 50.1045 20.0645 27.6392 70.7654 29.4896 69.0391 52.8889 1.5651 0.2399 5.3437 18.5647 32.5557 3.8804 49.3082 23.2674 4.7766
temp: 298.150 k
press: 1.00000 atm
elementType: 8 6 6 6 6 6 6 6 6 6 6 6 6 6 6 6 6 6 6 6 6 1 1 1 1 1 1 1 1 1 1 1 1 1 1 1 1
symmnumber: 1
zpe: 785877.1 jmol-1
zpe.correction: 0.299325 hartree
zpe.thermalcorrener: 0.314608 hartree
zpe.thermalcorrenthalpy: 0.315552 hartree
zpe.thermalcorrgfe: 0.257771 hartree
zpe.sumelectzpe: -845.568890 hartree
zpe.sumelectthermal: -845.553607 hartree
zpe.sumelectthermalent: -845.552663 hartree
zpe.sumelectthermalfe: -845.610444 hartree
dipole: 2.2534 -1.2769 0.7792
dipole: 2.7047
quadrupole: -94.6638 -110.3773 -128.8469
quadrupole: -1.7382 3.3013 2.5761
quadrupole: 16.6322 0.9187 -17.5509 -1.7382 3.3013 2.5761
hfenergy: -845.8682151 hartree
pointgroup: C01 [X(C20H16O1)]
dipole: -0.8861139 -0.4985162 -0.3140593 debye
polarizability: 375.9532016|-3.807492|239.2574434|6.6475596|-2.3239355|99.2762576 unknown
InChI: InChI=1S/C20H16O/c21-18-6-2-5-15-16-10-9-13-4-1-3-12-7-8-14(11-17(15)18)20(16)19(12)13/h1,3-4,7-11,18,21H,2,5-6H2
charge 0 multiplicity 1
37 atoms
O  -4.086923 2.072421 0.496029
C  -1.801591 -0.776647 -0.102724
C  -2.317711 0.549231 -0.149838
C  -3.819825 0.809973 -0.228311
C  -2.733513 -1.988095 -0.07284
C  -4.644133 -0.362324 0.329069
C  -4.210259 -1.657465 -0.386525
C  -0.381597 -0.971167 -0.045324
C  0.507335 0.165871 -0.051724
C  -0.040065 1.498318 -0.103388
C  -1.444747 1.659838 -0.148427
C  1.933216 -0.015478 0.000335
C  0.215793 -2.291046 0.028409
C  2.493498 -1.34265 0.063291
C  2.81241 1.130141 -0.006285
C  0.861306 2.631314 -0.104279
C  1.587566 -2.468405 0.078776
C  2.231792 2.455773 -0.060394
C  3.90524 -1.503949 0.112287
C  4.217711 0.925062 0.043752
C  4.756188 -0.378985 0.101369
H  -4.098954 0.949255 -1.299627
H  -2.376974 -2.757189 -0.784778
H  -2.673388 -2.453967 0.933449
H  -5.725245 -0.172744 0.17542
H  -4.4678 -0.443701 1.419045
H  -4.34206 -1.529318 -1.480253
H  -4.852825 -2.504913 -0.084666
H  -1.8791 2.664244 -0.157226
H  -0.433861 -3.17097 0.050078
H  0.428972 3.638045 -0.140498
H  2.01143 -3.478395 0.133496
H  2.905458 3.320747 -0.063145
H  -5.053197 2.276786 0.416715
H  4.327404 -2.514593 0.159963
H  4.88499 1.795049 0.038483
H  5.84226 -0.517366 0.139387
