program: Gaussian 09
title: 000097666
version: EM64L-G09RevD.01
frameworkgroup: C1[X(C15H10N2)]
method: RPBEPBE
basis: SDD
operation: Freq
keyword: #pfreq=noraman
keyword: PBEPBE/SDD
title: #p freq=noraman PBEPBE/SDD
converged: NO YES NO YES
title: Mulliken charges:
elementType: N N C C C C C C C C C C C C C C C H H H H H H H H H H
charge: -0.488041 -0.003827 0.190777 0.252355 0.183762 0.230093 -0.593332 -0.584012 0.479134 0.347027 -0.389068 -0.372008 -0.349812 -0.253972 -0.523652 -0.210171 -0.358628 0.307686 0.243609 0.242197 0.236632 0.235543 0.233697 0.226647 0.252577 0.226331 0.238456
chargesum: 0.00000
title: Mulliken charges with hydrogens summed into heavy atoms:
elementType: N N C C C C C C C C C C C C C C C
charge: -0.180355 -0.003827 0.190777 0.252355 0.183762 0.230093 -0.349723 -0.341815 0.479134 0.347027 -0.152436 -0.136464 -0.116114 -0.027324 -0.271075 0.016160 -0.120173
polarizability: 3.44905339e+02 2.32331624e+00 1.73785226e+02 -1.05484724e-03 5.23412442e-03 6.63693866e+01
1716.lowfreq: -5.5750 -0.0011 0.0003 0.0007 3.9138 11.7024 67.8638 103.9355 153.9273
frequency: 67.8607 103.9355 153.9236 169.8074 218.8507 306.5471 313.5408 335.3512 348.2483 405.7568 446.8444 468.1308 487.4443 503.8024 539.9454 568.9067 579.9010 582.0042 613.1135 645.3437 713.1470 722.9000 754.9620 757.7334 770.6610 785.1421 798.4927 816.3042 858.2817 860.0024 877.9916 892.1475 897.3481 938.2964 940.8820 964.5865 971.4315 976.5921 1017.5009 1021.5611 1106.8050 1159.0200 1170.3243 1181.1128 1207.2173 1232.3457 1244.8168 1249.9956 1263.8601 1298.6896 1326.3286 1363.1533 1372.1535 1403.0053 1422.1746 1434.5720 1452.7265 1464.9595 1482.9267 1486.5032 1574.2402 1592.7332 1595.8839 1627.9253 1652.6337 3099.6869 3127.4740 3128.8648 3132.1315 3135.8783 3136.7599 3149.2213 3154.0013 3167.0511 3610.7512
redmass: 5.5475 4.2278 5.3498 5.5277 4.2142 5.4117 4.0608 5.0169 6.4765 3.2326 2.7709 2.6973 5.7631 1.1622 5.7640 3.8778 6.3644 4.2886 7.1828 7.0574 5.8236 3.6114 1.5799 5.5045 3.2141 2.2361 5.1465 1.4240 1.4504 5.0638 1.6182 1.4408 4.8416 1.4292 1.6127 1.4370 4.9354 1.3156 2.1059 2.4039 1.8758 1.9267 1.2147 1.4066 2.0206 1.4634 1.6088 2.8883 2.1646 3.4738 1.5976 1.5276 6.7109 3.5097 4.2625 2.0707 4.2548 3.9844 3.5175 3.1336 7.5195 6.3415 6.9265 7.1547 8.0271 1.0908 1.0870 1.0855 1.0919 1.0910 1.0907 1.0952 1.0983 1.1002 1.0801
irintensity: 0.3621 0.3226 0.0208 1.4489 0.0230 0.1012 0.0489 3.2738 0.3610 5.5108 0.0597 5.6438 2.4365 118.7194 0.1443 0.0000 4.9353 7.5013 9.7610 1.4238 4.3665 21.1333 76.4742 1.6845 10.0410 4.6901 3.6522 4.6973 0.0005 5.1120 48.6940 36.1803 6.5080 9.7465 5.5965 2.4362 1.7024 0.0192 8.2092 2.4464 7.7448 11.0837 1.5662 1.8158 0.0805 2.3547 52.7125 86.4327 10.0499 7.5560 32.1006 53.6076 5.4960 3.5825 1.5790 4.0457 48.6529 88.9161 64.8566 3.4820 7.2597 6.0988 2.6321 109.6281 38.6262 18.6376 1.1141 0.6665 12.4637 4.0157 2.3121 27.5114 50.5606 33.8648 53.7140
temp: 298.150 k
press: 1.00000 atm
elementType: 7 7 6 6 6 6 6 6 6 6 6 6 6 6 6 6 6 1 1 1 1 1 1 1 1 1 1
symmnumber: 1
zpe: 546712.2 jmol-1
zpe.correction: 0.208232 hartree
zpe.thermalcorrener: 0.219750 hartree
zpe.thermalcorrenthalpy: 0.220694 hartree
zpe.thermalcorrgfe: 0.170799 hartree
zpe.sumelectzpe: -686.002821 hartree
zpe.sumelectthermal: -685.991303 hartree
zpe.sumelectthermalent: -685.990359 hartree
zpe.sumelectthermalfe: -686.040254 hartree
dipole: -3.9565 3.1826 0.0001
dipole: 5.0777
quadrupole: -103.6259 -80.2876 -105.1480
quadrupole: 7.0276 0.0003 0.0011
quadrupole: -7.2720 16.0662 -8.7942 7.0276 0.0003 0.0011
hfenergy: -686.211053 hartree
pointgroup: C01 [X(C15H10N2)]
dipole: 1.5599286 -1.247993 0.0000543 debye
dipolederiv: -1.4455072 -0.1443986 -0.0000011 0.0180352 -0.4494616 0.0000217 -0.000036 0.0000368 -0.3262383 -0.7059415 -0.0561359 0. -0.0479556 -0.3267119 0.000003 0.0000029 0.0000018 -0.255911 0.2440098 -0.0705011 0.0000056 0.5111911 -0.115861 0.0000098 -0.0000273 0.0000031 -0.0112833 1.0572689 -0.2292474 0.0000298 -0.8502372 0.137455 -0.0000179 0.000074 -0.0000136 0.0861665 0.0783962 0.1727513 -0.0000103 -0.3778158 -0.1536563 0.000004 0.0000195 0.0000073 -0.0247767 0.5389653 0.4250684 -0.0000209 0.8683763 0.3859204 -0.0000129 -0.0000352 -0.0000148 0.0772688 0.1638618 0.0232653 0.0000004 -0.041446 0.1050847 -0.0000099 0.000002 -0.0000087 -0.1467903 -0.50376 0.1164403 -0.0000101 0.0832675 0.085871 -0.0000149 -0.0000103 -0.0000213 -0.2417893 0.3178632 -0.1044257 0.0000038 -0.3297896 0.0298286 0. 0.0000164 0.000002 0.0507536 -0.2856485 0.0191114 -0.0000025 0.2831687 -0.278668 0.0000149 -0.0000094 0.0000149 0.0622414 0.1921154 -0.0686022 0.000006 0.1614476 0.0985392 -0.0000127 -0.0000062 -0.0000118 -0.1365066 -0.145717 -0.2453984 0.0000148 -0.1213129 -0.0045934 -0.0000133 0.000005 -0.0000145 -0.2080054 -0.2112334 0.0426538 -0.0000013 0.1965865 0.0707298 -0.0000078 -0.0000074 -0.0000079 -0.1493421 -0.2634359 0.1228638 -0.0000083 0.1856973 -0.0472396 -0.000007 -0.0000113 -0.0000079 -0.188598 0.5054733 -0.037168 0.0000041 -0.2087657 0.3378564 -0.000017 0.000009 -0.0000147 -0.0778767 0.0114515 0.0269706 0.0000011 -0.141595 0.1464296 -0.0000204 0.0000178 -0.000019 -0.1542339 0.2637223 0.1808297 -0.0000075 0.0671939 0.1951021 -0.0000134 -0.0000077 -0.0000136 -0.1133131 0.1094045 -0.0178591 -0.0000029 -0.0452405 0.1989536 0.000004 0.0000015 -0.000008 0.341852 0.0717377 -0.017537 0.0000004 -0.0421278 -0.0663334 0.0000088 0.0000033 0.0000081 0.1503083 0.0519401 -0.0305462 0.0000014 -0.0121604 -0.0881435 0.000012 0.0000004 0.0000164 0.1789767 0.0689856 0.093881 -0.0000058 0.0374238 -0.0580172 0.0000122 -0.0000015 0.0000113 0.1504124 0.0518601 0.0391757 -0.0000032 0.0976553 -0.0889311 0.0000169 -0.0000057 0.0000149 0.1788107 0.0699356 0.0073641 -0.0000005 -0.099965 -0.1122297 0.0000106 0.0000033 0.0000099 0.1560187 -0.0268713 -0.0983038 0.0000046 -0.1260677 -0.0456687 0.0000119 0.0000046 0.0000115 0.1682814 0.0687734 -0.0783649 0.0000031 -0.0127455 -0.1021736 0.0000089 -0.0000006 0.0000073 0.1230616 -0.1507236 0.0239058 -0.0000046 0.0222758 0.0898426 0.0000046 -0.0000077 0.0000056 0.1597843 -0.1269266 -0.0957928 0.0000038 -0.0750942 0.0560759 0.0000038 0.0000065 0.0000049 0.1507284 unknown
polarizability: 344.8918225|2.7767877|173.7987423|0.0010687|-0.0052313|66.3693866 unknown
InChI: InChI=1S/C15H10N2/c1-2-4-14-12(3-1)13-7-11-9-16-6-5-10(11)8-15(13)17-14/h1-9,17H
charge 0 multiplicity 1
27 atoms
N  1.412582 -1.776001 0.000139
N  -4.410838 1.137042 -0.00003
C  0.426027 0.314732 0.000019
C  0.172264 -1.119742 0.00007
C  1.878547 0.486526 0.000012
C  2.456249 -0.828917 0.000097
C  -0.650228 1.204394 -0.000028
C  -1.117966 -1.652932 0.000083
C  -2.221962 -0.745582 0.000052
C  -1.984848 0.692558 -0.000005
C  2.725232 1.617157 -0.000051
C  3.850393 -1.032133 0.00012
C  -3.590972 -1.178359 0.000069
C  4.124383 1.424822 -0.000032
C  -3.132399 1.558804 -0.000047
C  4.677029 0.114631 0.000051
C  -4.619666 -0.236258 0.000025
H  1.53914 -2.785379 0.000164
H  -0.491374 2.289109 -0.000073
H  -1.299515 -2.733383 0.000135
H  2.306228 2.629537 -0.000109
H  4.28539 -2.037391 0.000184
H  -3.826737 -2.248494 0.000111
H  4.793904 2.291389 -0.000078
H  -2.981376 2.64694 -0.000088
H  5.765689 -0.009433 0.000071
H  -5.669775 -0.547838 0.000039
