program: Gaussian 09
title: 000097673
version: EM64L-G09RevD.01
frameworkgroup: C1[X(C10H9NOS2)]
method: RPBEPBE
basis: SDD
operation: Freq
keyword: #p
keyword: freq=noraman
keyword: PBEPBE/SDD
title: #p freq=noraman PBEPBE/SDD
converged: NO YES NO NO
title: Mulliken charges:
elementType: S S O N C C C C C C C C C C H H H H H H H H H
charge: 0.317531 0.119523 -0.212864 -0.025942 -0.600428 0.506043 0.323369 -0.786643 -0.526980 -0.384500 -0.372336 -0.227736 -0.233795 -0.232040 0.258648 0.257312 0.305088 0.307067 0.255116 0.265585 0.228766 0.228586 0.230632
chargesum: 0.00000
title: Mulliken charges with hydrogens summed into heavy atoms:
elementType: S S O N C C C C C C C C C C
charge: 0.317531 0.119523 -0.212864 -0.025942 -0.084468 0.506043 0.323369 -0.174488 -0.526980 -0.129384 -0.106751 0.001030 -0.005210 -0.001408
polarizability: 1.62478450e+02 -8.45661641e-01 1.80141727e+02 2.06391469e+00 3.17084950e+00 9.06222036e+01
1716.lowfreq: -5.0364 -0.0006 0.0009 0.0014 5.4871 9.0586 26.5228 49.3038 69.1257
frequency: 26.3901 49.3018 69.1108 98.0483 121.1872 192.4409 206.9765 261.5513 304.9712 377.4345 398.4917 405.7716 432.3005 493.8195 510.6770 520.0514 551.1837 590.6774 617.4337 648.7019 706.7214 718.8347 758.4992 816.7244 820.2067 862.0564 890.4360 914.7814 941.3151 986.5376 990.3439 996.5550 1001.6593 1028.1111 1063.5448 1087.9430 1117.0884 1174.0477 1191.8350 1195.2065 1211.3768 1223.3639 1265.5654 1318.6082 1347.8887 1371.0633 1386.1264 1421.9203 1444.1009 1451.9208 1484.8368 1594.3317 1613.3376 1633.2201 3032.1182 3050.6926 3096.6545 3123.6964 3125.9843 3133.6111 3144.0567 3153.3493 3166.6446
redmass: 4.8972 8.2454 5.5001 9.0775 3.1728 5.5907 6.1172 10.2123 8.9657 2.2524 7.7209 2.8732 5.1330 5.0006 13.4720 7.4071 3.8087 4.8768 6.2320 4.6508 1.9395 4.2493 2.3035 3.7411 3.3202 1.2425 1.6396 2.9575 1.5140 1.3916 5.7090 3.1556 1.3299 2.2687 9.5510 1.5955 1.1666 1.0584 1.1367 2.0405 2.8117 1.4689 3.7758 1.7251 1.4902 1.4301 5.7311 1.0811 2.0775 1.1363 2.2188 6.0559 5.9918 11.5796 1.0588 1.0570 1.1052 1.1067 1.0848 1.0882 1.0927 1.0967 1.1017
irintensity: 0.2705 0.9312 0.6604 1.9886 9.7463 0.3075 1.2706 4.2654 1.4023 4.1552 5.7648 0.0934 5.0333 27.6207 4.4768 6.2299 5.2557 17.4877 0.0525 27.8767 57.9445 28.7667 16.6050 10.7539 6.4226 1.3057 7.3714 20.4585 13.7347 1.5561 0.8278 20.1404 0.8669 8.4735 26.0519 40.7070 0.2743 2.0507 3.8779 224.9351 8.0342 86.3134 131.4902 126.9608 71.5846 31.1703 12.1042 13.1894 7.9477 37.5156 17.1867 4.1317 1.3377 216.9087 13.9336 3.6832 0.4775 0.0225 0.1264 3.8330 13.8116 20.9643 21.9117
temp: 298.150 k
press: 1.00000 atm
elementType: 16 16 8 7 6 6 6 6 6 6 6 6 6 6 1 1 1 1 1 1 1 1 1
symmnumber: 1
zpe: 442220.2 jmol-1
zpe.correction: 0.168433 hartree
zpe.thermalcorrener: 0.180840 hartree
zpe.thermalcorrenthalpy: 0.181784 hartree
zpe.thermalcorrgfe: 0.127654 hartree
zpe.sumelectzpe: -1311.581146 hartree
zpe.sumelectthermal: -1311.568739 hartree
zpe.sumelectthermalent: -1311.567795 hartree
zpe.sumelectthermalfe: -1311.621925 hartree
dipole: -0.3563 -1.5753 -0.5259
dipole: 1.6985
quadrupole: -89.0834 -100.8595 -95.0961
quadrupole: -8.8024 2.2023 3.3050
quadrupole: 5.9296 -5.8465 -0.0831 -8.8024 2.2023 3.3050
hfenergy: -1311.7495792 hartree
pointgroup: C01 [X(C10H9N1O1S2)]
dipole: -0.0713858 -0.6155075 -0.2502241 debye
dipolederiv: -0.3696939 0.1611771 0.2343214 0.1810424 -0.0730104 -0.1301959 0.3299583 -0.1318132 -0.1521057 -0.3099774 0.1650187 0.1169343 0.1580201 -0.757452 -0.1947475 0.1471084 -0.1918219 -0.2269589 -0.5341195 -0.2767423 0.082441 -0.056823 -1.1387007 0.0977119 0.1119926 0.2324131 -0.3902381 -0.8131296 0.0153581 0.2039382 -0.2776959 -1.6542329 0.0551173 0.3870737 -0.0914391 -0.3005266 0.7306094 0.0632191 0.0017552 -0.050534 0.0805993 0.0201925 -0.1537224 -0.0517877 0.3044402 0.0895972 0.0168412 0.0747798 0.0080787 0.0053982 0.0018364 0.0641454 0.0147673 -0.1296097 0.6174431 -0.083122 -0.2476147 -0.1411649 1.6655478 -0.0205056 -0.3052275 0.0870004 0.3879179 -0.2681074 0.0144294 0.2565945 0.0742246 0.1809246 -0.0509234 0.3187972 -0.0027619 -0.0958892 0.756047 -0.0002289 -0.5885687 0.0481185 1.5692405 0.2638888 -0.7328566 0.1148998 0.2859566 -0.1118702 0.065721 0.0443667 0.027006 -0.0246429 0.0112054 0.0290387 0.0086769 -0.1129881 -0.1035405 -0.0868352 0.0478425 -0.0290268 -0.0172838 -0.0085797 0.0296449 -0.0070308 -0.1146323 -0.0703736 -0.1014308 0.052213 -0.1131987 0.0908877 -0.0307849 0.0502758 -0.0550739 -0.1137629 -0.0858596 0.0873741 0.0499004 0.092136 0.1064797 0.0406305 0.0468796 0.0573596 -0.1164459 0.0340628 -0.0006021 0.126399 0.0023267 -0.0438706 0.0040974 0.1054375 0.0035436 -0.0817334 0.0177428 -0.0080769 -0.0293046 0.0285413 0.0258102 -0.1403104 -0.0083009 -0.0140734 0.0860387 -0.0180388 0.0083263 -0.0168826 0.0011685 0.0120174 0.1315366 -0.0010647 0.0163904 0.0628156 0.0517611 0.0128092 -0.0316565 0.0491657 -0.0029862 0.0194163 -0.0525778 0.0570683 0.1058703 0.1152957 -0.0596059 -0.0417463 -0.0119045 0.0039033 -0.0504514 -0.0124435 -0.025682 0.0347478 0.1316009 -0.0860578 -0.0598616 -0.0639387 -0.0073866 -0.0326593 -0.0476685 -0.0272975 0.1122155 0.117338 0.0938896 -0.0521095 0.0712667 0.0201775 0.0240575 -0.0470156 0.0231027 0.1148432 0.0405321 0.0711312 -0.0536722 0.0979907 -0.0604873 0.0395167 -0.0640088 0.0346079 0.1254416 0.0526213 -0.0667226 -0.0501238 -0.0886741 -0.0737163 -0.0457941 -0.0621103 -0.0453109 0.1248046 -0.069941 -0.0058707 -0.1199457 -0.0061253 0.0927835 -0.0042551 -0.1333559 -0.0057377 0.0897987 unknown
polarizability: 162.9679879|-2.7446753|178.6855232|-1.1902851|9.9806867|91.5888689 unknown
InChI: InChI=1S/C10H9NOS2/c12-9-7-14-10(13)11(9)6-8-4-2-1-3-5-8/h1-5H,6-7H2
charge 0 multiplicity 1
23 atoms
S  3.387696 0.786597 -1.037481
S  1.58949 2.783871 0.469793
O  1.364247 -2.324515 0.402008
N  1.332459 0.030774 0.478929
C  0.123796 0.056774 1.362913
C  -1.187799 0.016439 0.58596
C  1.845959 -1.218748 0.053837
C  3.047378 -1.061332 -0.872709
C  1.980208 1.20004 0.058754
C  -1.857023 1.218491 0.2415
C  -1.764683 -1.227935 0.221986
C  -3.0817 1.177196 -0.462097
C  -2.989088 -1.267856 -0.481247
C  -3.650521 -0.065702 -0.824988
H  0.203538 0.977925 1.963749
H  0.216032 -0.826402 2.01802
H  3.924385 -1.568893 -0.442556
H  2.818774 -1.491028 -1.860446
H  -1.413264 2.180728 0.520878
H  -1.247243 -2.157006 0.486562
H  -3.592259 2.110805 -0.72307
H  -3.428187 -2.233225 -0.756405
H  -4.601996 -0.097399 -1.367692
