program: Gaussian 09
title: 000097626
version: EM64L-G09RevD.01
frameworkgroup: C1[X(C6H2FN3O6)]
method: RPBEPBE
basis: SDD
operation: Freq
keyword: #p
keyword: freq=noraman
keyword: PBEPBE/SDD
title: #p freq=noraman PBEPBE/SDD
converged: NO NO NO NO
title: Mulliken charges:
elementType: F O O O O O O N N N C C C C C C H H
charge: -0.080509 -0.173669 -0.173670 -0.145224 -0.145223 -0.169567 -0.169566 0.028563 0.028562 0.021618 0.329785 0.329786 0.504510 0.109254 -0.499948 -0.499946 0.352622 0.352623
chargesum: 0.00000
title: Mulliken charges with hydrogens summed into heavy atoms:
elementType: F O O O O O O N N N C C C C C C
charge: -0.080509 -0.173669 -0.173670 -0.145224 -0.145223 -0.169567 -0.169566 0.028563 0.028562 0.021618 0.329785 0.329786 0.504510 0.109254 -0.147326 -0.147324
polarizability: 1.57667658e+02 -1.57107382e-05 1.53112158e+02 -3.99791389e-03 -6.22327685e-03 4.00944738e+01
1716.lowfreq: -28.7818 -23.9213 -4.4554 0.0008 0.0010 0.0011 5.7264 6.5399 55.5319
frequency: -28.1793 -23.8714 55.5145 68.2512 117.4043 145.9245 168.3073 194.0862 296.1612 314.9505 322.0384 329.6232 344.2988 354.3119 430.6790 460.1628 522.0561 530.3949 638.2107 647.6554 653.4319 682.1107 707.7104 711.9538 745.1132 766.6265 771.1423 847.0917 888.9654 985.9203 989.0903 1064.0863 1140.5075 1170.5075 1179.4673 1184.1406 1213.5064 1225.6415 1366.8056 1374.8442 1379.2470 1402.4384 1427.7487 1458.2290 1599.4733 1608.9580 3181.8335 3182.8309
redmass: 16.0724 15.9614 15.7734 16.6546 10.5953 14.4866 15.0443 5.2907 13.2880 15.2374 10.3690 13.5645 15.9435 12.8861 15.1721 5.5066 9.3048 4.6522 13.2924 5.9091 13.5885 10.1602 9.3124 5.3987 14.7400 7.8799 7.8184 12.6074 9.9771 1.5476 1.3541 1.7352 6.6968 1.4721 10.9965 13.6285 11.0023 5.8555 6.4715 8.0922 12.4715 11.7884 7.6485 5.1382 9.8686 8.7248 1.0917 1.0932
irintensity: 0.0063 0.0000 0.0000 0.7114 13.4552 2.7484 2.6441 0.0000 1.4315 0.0001 0.0150 0.1506 0.5100 0.0161 0.0232 0.0002 2.0236 2.4406 7.7163 2.2039 48.5879 41.8543 0.0002 12.9730 0.0329 1.2478 9.6499 42.0055 32.2001 43.1956 0.0000 84.9254 0.4115 16.0047 376.2846 125.4737 76.4290 48.5459 74.3750 74.5379 6.5962 16.4770 24.0997 158.0181 55.2297 54.8188 50.1495 13.9281
temp: 298.150 k
press: 1.00000 atm
elementType: 9 8 8 8 8 8 8 7 7 7 6 6 6 6 6 6 1 1
symmnumber: 1
zpe: 244334.0 jmol-1
zpe.correction: 0.093062 hartree
zpe.thermalcorrener: 0.104729 hartree
zpe.thermalcorrenthalpy: 0.105673 hartree
zpe.thermalcorrgfe: 0.054091 hartree
zpe.sumelectzpe: -943.839074 hartree
zpe.sumelectthermal: -943.827407 hartree
zpe.sumelectthermalent: -943.826463 hartree
zpe.sumelectthermalfe: -943.878045 hartree
dipole: -0.8015 0.0000 0.0027
dipole: 0.8015
quadrupole: -113.4474 -110.3664 -83.8975
quadrupole: 0.0000 -0.0112 0.0454
quadrupole: -10.8770 -7.7960 18.6729 0.0000 -0.0112 0.0454
hfenergy: -943.9321357 hartree
pointgroup: C01 [X(C6H2F1N3O6)]
dipole: -0.315337 0.0000536 -0.0010437 debye
dipolederiv: -0.7912575 0.000103 -0.0001079 0.0001022 -0.1614789 -0.0001414 -0.0001816 0.0004041 -0.0586835 -0.5046723 0.0217016 0.0011205 0.1036499 -0.7475137 -0.0008237 -0.0010924 0.0019339 -0.2016618 -0.504713 -0.0217832 -0.0012176 -0.1037262 -0.7474748 -0.0009748 0.0006459 0.0014332 -0.2016627 -0.6472166 -0.0594021 -0.0015124 -0.1610536 -0.4702268 0.0003521 0.0020803 0.0001533 -0.1806678 -0.6471512 0.0594641 0.0009519 0.1611106 -0.4702969 0.0002711 -0.0020772 0.0000188 -0.1806665 -0.6461819 0.1769976 0.0000096 0.0936448 -0.5885566 0.0002848 0.0005462 -0.0010141 -0.1984209 -0.6462702 -0.1769799 -0.0001575 -0.0936263 -0.588473 -0.0007831 0.0003349 0.0003263 -0.1984201 1.0949016 0.2647854 -0.0001038 0.2429606 1.5527152 -0.0004832 0.0000209 -0.0000858 0.1884928 1.0947486 -0.264647 0.0007945 -0.2428175 1.5528882 -0.0000279 0.0007504 0.0002701 0.188492 1.620287 -0.0001031 -0.0002778 -0.000105 0.9725231 0.0005585 -0.0000672 0.0009351 0.1791644 -0.3601306 -0.1478026 0.0004419 0.0296854 -0.4781671 0.0007481 -0.0004248 -0.001212 0.0703324 -0.3600991 0.1477738 -0.0005107 -0.0297202 -0.478214 0.000513 0.0001412 -0.0010131 0.0703325 -0.3813677 0.0000062 0.0003298 0.0000076 -0.3398307 -0.0000597 -0.000332 -0.0005469 0.0824268 0.9306764 -0.0000654 0.0001591 -0.0000663 0.5304006 0.0002718 0.0000769 -0.0009009 0.1624054 0.168967 0.2365872 -0.0000181 0.1404166 0.0337259 0.0002063 -0.0003295 -0.0003191 -0.0444098 0.1688466 -0.2366328 0.0001226 -0.1404602 0.033848 0.000251 -0.0001076 -0.0004269 -0.0444086 0.2053208 0.0145995 -0.0000107 0.0178978 0.1970595 -0.0000842 0.0000423 0.0000161 0.1836775 0.205312 -0.0146023 -0.0000134 -0.0179003 0.1970721 -0.0000789 -0.0000266 0.000028 0.1836777 unknown
polarizability: 157.667658|-0.0006538|153.1121511|-0.0020456|-0.0295826|40.0944811 unknown
InChI: InChI=1S/C6H2FN3O6/c7-6-4(9(13)14)1-3(8(11)12)2-5(6)10(15)16/h1-2H
charge 0 multiplicity 1
18 atoms
F  2.651226 -0.000416 0.000529
O  0.454195 3.593948 -0.002596
O  0.453024 -3.594066 0.001512
O  2.512558 2.611295 -0.002439
O  2.511712 -2.612081 0.003103
O  -3.611258 1.143763 0.001973
O  -3.611622 -1.142573 0.000663
N  1.230085 2.563869 0.002652
N  1.229257 -2.564236 -0.002111
N  -3.01934 0.000501 -0.000712
C  0.55595 1.225112 0.001213
C  0.555551 -1.225263 -0.000976
C  -1.528041 0.000261 -0.000359
C  1.280008 -0.000194 0.000271
C  -0.849696 1.228387 0.000799
C  -0.850094 -1.228085 -0.001173
H  -1.392754 2.177918 0.001459
H  -1.39346 -2.177439 -0.002108
