program: Gaussian 09
title: 000097610
version: EM64L-G09RevD.01
frameworkgroup: C1[X(C14H13N)]
method: RPBEPBE
basis: SDD
operation: Freq
keyword: #pfreq=noraman
keyword: PBEPBE/SDD
title: #p freq=noraman PBEPBE/SDD
converged: NO NO NO NO
title: Mulliken charges:
elementType: N C C C C C C C C C C C C C C H H H H H H H H H H H H H
charge: -0.483358 0.181245 0.229557 0.180705 0.219121 -0.612148 0.342886 0.392249 -0.587887 -0.397498 -0.371480 -0.828887 -0.822188 -0.256912 -0.217221 0.300253 0.238179 0.236268 0.232180 0.230107 0.222036 0.222104 0.230594 0.227878 0.225353 0.225364 0.220535 0.220961
chargesum: 0.00000
title: Mulliken charges with hydrogens summed into heavy atoms:
elementType: N C C C C C C C C C C C C C C
charge: -0.183105 0.181245 0.229557 0.180705 0.219121 -0.373969 0.342886 0.392249 -0.351619 -0.165318 -0.141372 -0.154152 -0.143592 -0.036377 0.003740
polarizability: 2.72537950e+02 3.62934908e+00 1.58921621e+02 -6.58331603e-04 7.29266870e-03 7.07338923e+01
1716.lowfreq: -8.1731 -0.0006 0.0004 0.0009 2.7420 11.9089 80.3987 102.4646 127.5780
frequency: 80.3924 102.4595 127.5714 166.5950 170.6035 215.5658 221.2157 292.0902 338.2649 343.6628 364.1849 388.9782 433.8507 451.1280 484.8352 489.9193 547.5286 572.1896 582.1469 626.6327 641.4251 717.6130 734.8379 736.7098 752.4485 775.3906 811.3202 852.6190 858.7376 859.9681 890.1635 933.2888 957.9006 970.6637 1003.2126 1005.7422 1017.2526 1029.1701 1051.1184 1103.4693 1131.4276 1166.0071 1189.3072 1209.8402 1231.7842 1257.9721 1263.2948 1319.9830 1340.2042 1387.2172 1391.3753 1403.4827 1412.6283 1437.9105 1461.9924 1462.0008 1467.6796 1476.7803 1481.1410 1488.6497 1495.7280 1580.6120 1588.2465 1623.6268 1646.5438 2963.5495 2967.9009 3035.8045 3042.5963 3073.8777 3077.2235 3122.9585 3125.9899 3129.2131 3131.9276 3144.5954 3161.9795 3613.9323
redmass: 4.0000 3.3158 1.0490 4.0939 1.2050 3.0895 2.8395 2.5015 4.1295 3.8574 4.2258 4.8106 2.8305 3.0113 1.1349 5.0046 3.8067 3.6498 5.1584 6.1873 3.8009 5.8840 4.6524 2.2913 1.8309 2.7978 4.7905 1.4586 4.5090 1.4374 1.4738 1.3990 3.3388 1.3057 1.4788 1.7119 1.8622 1.4366 1.6251 2.1771 2.5280 1.1091 1.6778 3.0833 1.4216 2.6651 1.4647 3.2822 2.2573 3.0146 1.3501 1.3324 3.6876 2.2857 1.9362 1.0478 2.4931 1.0460 1.1982 2.9794 2.4531 7.1310 6.3593 6.9789 7.7230 1.0374 1.0372 1.0973 1.0971 1.0985 1.0980 1.0849 1.0915 1.0913 1.0895 1.0953 1.1002 1.0801
irintensity: 2.5937 0.7572 0.0065 0.6516 0.3813 1.0764 0.3890 0.4290 0.5672 0.7309 0.4796 1.1744 8.5906 0.9848 110.0692 0.7537 2.4663 3.1541 2.3943 2.8594 1.4864 0.9953 1.0477 39.6322 58.9249 13.0002 1.4619 1.5108 0.5977 28.0594 7.9231 2.4572 7.5226 0.0089 10.8587 2.2699 17.5201 16.6256 0.0030 3.0574 6.9141 2.1956 9.5232 3.0212 18.4297 39.5661 11.0885 22.9260 41.7813 5.2508 3.5636 7.5987 21.1890 5.5487 63.6165 0.0544 21.1030 30.0805 13.0270 33.0732 13.6206 0.4259 0.9661 35.3077 13.4566 62.3780 49.8042 35.5877 12.8731 37.2324 7.9240 0.1657 29.3729 1.5749 3.6297 36.3650 36.0704 46.1159
temp: 298.150 k
press: 1.00000 atm
elementType: 7 6 6 6 6 6 6 6 6 6 6 6 6 6 6 1 1 1 1 1 1 1 1 1 1 1 1 1
symmnumber: 1
zpe: 599388.0 jmol-1
zpe.correction: 0.228295 hartree
zpe.thermalcorrener: 0.240624 hartree
zpe.thermalcorrenthalpy: 0.241568 hartree
zpe.thermalcorrgfe: 0.190462 hartree
zpe.sumelectzpe: -595.038145 hartree
zpe.sumelectthermal: -595.025815 hartree
zpe.sumelectthermalent: -595.024871 hartree
zpe.sumelectthermalfe: -595.075977 hartree
dipole: -0.8766 -1.6041 0.0001
dipole: 1.8280
quadrupole: -78.4973 -73.2349 -95.0343
quadrupole: -2.2597 -0.0009 0.0017
quadrupole: 3.7582 9.0206 -12.7788 -2.2597 -0.0009 0.0017
hfenergy: -595.2664395 hartree
pointgroup: C01 [X(C14H13N1)]
dipole: 0.3513834 0.6275242 0.0000473 debye
polarizability: 272.6007816|2.4555041|158.858789|0.000583|-0.0072991|70.7338923 unknown
InChI: InChI=1S/C14H13N/c1-9-7-12-11-5-3-4-6-13(11)15-14(12)8-10(9)2/h3-8,15H,1-2H3
charge 0 multiplicity 1
28 atoms
N  -0.741402 1.760561 -0.000183
C  0.133936 -0.371385 -0.000046
C  0.458731 1.02613 -0.000124
C  -1.322226 -0.471401 -0.000051
C  -1.833114 0.875036 -0.000099
C  1.1866 -1.315862 -0.000032
C  2.53293 -0.886248 -0.000064
C  2.837787 0.519238 -0.00019
C  1.7953 1.475484 -0.000248
C  -2.232505 -1.55493 -0.000037
C  -3.217344 1.150678 -0.000128
C  3.655517 -1.911952 0.000206
C  4.284401 0.98591 -0.000325
C  -3.61869 -1.287509 -0.000052
C  -4.103575 0.051001 -0.000095
H  -0.808865 2.775226 -0.000257
H  0.962532 -2.388924 0.000033
H  2.03325 2.545437 -0.000341
H  -1.868918 -2.588629 0.000015
H  -3.597835 2.178226 -0.000172
H  4.30861 -1.808281 -0.888083
H  4.306763 -1.809586 0.89001
H  3.251982 -2.939392 -0.000979
H  4.350071 2.087914 -0.000354
H  4.831776 0.61622 0.888116
H  4.831584 0.616189 -0.888869
H  -4.332628 -2.118545 -0.00003
H  -5.184469 0.232595 -0.000118
