program: Gaussian 09
title: 000097607
version: EM64L-G09RevD.01
frameworkgroup: C1[X(C9H11N3O)]
method: RPBEPBE
basis: SDD
operation: Freq
keyword: #p
keyword: freq=noraman
keyword: PBEPBE/SDD
title: #p freq=noraman PBEPBE/SDD
converged: NO YES NO NO
title: Mulliken charges:
elementType: O N N N C C C C C C C C C H H H H H H H H H H H
charge: -0.249516 -0.146155 -0.169567 0.014264 0.321119 -0.373310 -0.373316 0.286027 -0.617276 -0.196463 -0.196483 -0.244731 -0.740114 0.238153 0.238161 0.250893 0.268555 0.250839 0.228986 0.228959 0.231017 0.251092 0.247739 0.251126
chargesum: 0.00000
title: Mulliken charges with hydrogens summed into heavy atoms:
elementType: O N N N C C C C C C C C C
charge: -0.249516 -0.146155 -0.169567 0.014264 0.321119 -0.135157 -0.135155 0.286027 0.153012 0.032523 0.032476 -0.013714 0.009844
polarizability: 2.04722082e+02 8.48591800e+00 8.53913054e+01 8.30056535e-02 -3.06723778e-01 1.00584067e+02
1716.lowfreq: -78.7829 -10.2843 -8.4426 -2.8648 0.0004 0.0006 0.0007 60.8425 63.6577
frequency: -78.7808 60.7310 63.6569 104.3188 112.7082 140.0928 160.4701 188.3842 248.5286 318.2750 352.5513 391.4542 400.9923 457.7291 468.8856 540.8019 559.9867 573.9469 612.5344 631.1226 695.1198 748.6143 768.1287 836.4358 873.9752 910.7458 951.3228 964.4899 967.9348 985.3390 988.9997 1022.3436 1035.8861 1075.8763 1114.8183 1134.1915 1164.8360 1170.7411 1181.6153 1222.8646 1305.0732 1324.7341 1374.7890 1384.3794 1392.3203 1417.1881 1432.9680 1443.8170 1452.7966 1461.0882 1467.1479 1477.8903 1587.3216 1602.4535 1627.5838 3005.8481 3013.9006 3091.5508 3102.9711 3128.5978 3135.9348 3141.0639 3143.0282 3149.9236 3157.8886 3170.3327
redmass: 3.9660 4.0265 4.9307 1.1287 3.5795 2.4969 1.3185 4.2502 4.0738 4.2103 5.2302 4.1454 3.0570 3.5961 6.8032 4.8410 4.6861 2.9755 6.5218 4.6252 1.9894 2.5288 2.6808 1.2452 3.2319 1.7195 2.6450 1.3745 2.0833 5.7070 1.3319 2.1035 1.6753 1.5447 1.3259 2.7402 2.2154 1.0528 1.3494 4.1836 1.3500 4.8962 7.6651 1.2251 2.4232 1.8296 2.2678 1.0789 1.0481 1.0446 2.0546 1.1767 6.3291 6.1454 8.3202 1.0329 1.0361 1.1008 1.0968 1.0845 1.0880 1.1021 1.1016 1.0924 1.0967 1.1017
irintensity: 0.0366 1.3946 0.0195 0.0127 6.3938 2.1811 0.0832 4.3091 1.9325 15.0878 3.4678 0.3696 0.3553 13.5494 0.3452 16.1514 5.7177 2.2965 0.0728 18.0061 37.3648 46.4128 50.3297 0.0071 22.9947 4.8290 0.8056 0.0156 242.3455 0.8617 0.2197 9.1125 7.2736 11.3154 0.2209 165.1272 45.5120 0.1785 18.8972 15.4546 0.0098 301.3036 0.3406 39.9733 66.5212 149.2505 4.8988 42.0187 15.9428 24.2539 81.1050 18.6259 4.3660 33.0716 218.0963 15.0481 1.8402 14.2464 7.5686 1.8812 4.1220 16.7283 1.0955 16.4921 28.6202 18.6173
temp: 298.150 k
press: 1.00000 atm
elementType: 8 7 7 7 6 6 6 6 6 6 6 6 6 1 1 1 1 1 1 1 1 1 1 1
symmnumber: 1
zpe: 491629.5 jmol-1
zpe.correction: 0.187252 hartree
zpe.thermalcorrener: 0.199223 hartree
zpe.thermalcorrenthalpy: 0.200167 hartree
zpe.thermalcorrgfe: 0.148558 hartree
zpe.sumelectzpe: -588.033649 hartree
zpe.sumelectthermal: -588.021678 hartree
zpe.sumelectthermalent: -588.020734 hartree
zpe.sumelectthermalfe: -588.072343 hartree
dipole: 2.5240 0.4332 0.0044
dipole: 2.5609
quadrupole: -86.0306 -75.1363 -69.1996
quadrupole: 2.6765 0.0449 -0.0970
quadrupole: -9.2418 1.6525 7.5893 2.6765 0.0449 -0.0970
hfenergy: -588.220901 hartree
pointgroup: C01 [X(C9H11N3O1)]
dipole: 0.9933689 0.1683743 -0.0001515 debye
dipolederiv: -1.4382571 0.1101036 0.0012405 -0.1009191 -0.5572603 0.0009411 0.0005775 0.000594 -0.3319823 -1.8615333 0.3737142 0.0003543 0.3264567 -0.4890338 0.0007212 0.0011707 0.000288 -0.1810305 -1.2684916 -0.0707718 0.0006373 0.2927561 -0.2086988 -0.0008023 0.001997 -0.0001053 -0.1891099 1.78472 -0.135163 -0.0016995 0.1968943 -0.1757188 0.000859 -0.0037781 0.0004403 0.0280523 1.0105268 0.1402114 0.0001799 0.3311849 0.0440868 -0.0002669 -0.0013202 0.0000728 0.0836719 -0.3219605 0.0174533 -0.0308042 -0.0479464 -0.145284 -0.0045627 -0.0765922 -0.0578026 0.0216387 -0.3219387 0.0173038 0.0311222 -0.0463125 -0.1454562 0.0039059 0.0774735 0.0571171 0.0215001 2.0627239 -0.4041364 -0.0011539 -0.8865049 1.1564635 -0.0022541 0.0005447 -0.0026506 0.1768016 -0.0303123 0.0649476 0.0000689 -0.0292268 0.1772575 0.0000899 0.0009863 -0.0001127 0.1863181 0.0481735 0.0593025 0.0347296 0.0673703 -0.1183599 0.0106806 0.0106861 0.0210015 0.1132392 0.0483656 0.0594287 -0.0344836 0.067227 -0.1181133 -0.0118481 -0.0106097 -0.0221364 0.1132205 0.0101115 0.0672875 0.0000702 0.0448844 -0.1588468 -0.0000927 -0.0001692 -0.0001226 -0.1324567 0.0137955 -0.19782 0.0007184 -0.0293141 -0.3758796 0.0013967 -0.0000353 0.0023982 0.0229998 0.0712407 -0.0400531 0.0888028 -0.0352869 0.1411476 0.0224704 0.0775723 0.0220601 -0.0290351 0.0709555 -0.039667 -0.0890281 -0.0350661 0.1413154 -0.0215089 -0.0777919 -0.0212653 -0.0290721 0.0769338 0.056343 0.0891451 -0.0102996 0.0202989 -0.0272748 0.0606868 -0.0688576 -0.0352245 -0.0177965 -0.0855575 0.0004963 0.0188807 0.1537378 -0.0001211 0.0002455 0.0000463 0.1348013 0.0761244 0.0563073 -0.0898521 -0.0106428 0.0207904 0.0270755 -0.061244 0.0684356 -0.0352703 0.0070043 -0.0294139 -0.0850404 -0.0371149 0.1471732 -0.0223509 -0.1021194 -0.0242671 -0.0680716 0.0072049 -0.0297865 0.0848791 -0.0377369 0.1469115 0.0233695 0.1020095 0.025301 -0.0680587 -0.1181016 -0.0753948 -0.0000912 -0.0857844 0.144301 0.0001734 -0.0001085 0.0001652 0.0865772 0.0770594 -0.0200406 -0.0945078 -0.0123646 0.083456 0.0073389 -0.0923819 -0.0321255 -0.0074164 -0.0639628 0.1244393 -0.0002528 0.0704237 0.0322691 0.0002278 -0.00009 0.0002451 0.1257114 0.0774145 -0.0190377 0.094469 -0.0115582 0.0834428 -0.0081674 0.0922906 0.0312806 -0.0078039 unknown
polarizability: 204.7567588|8.2387988|85.3519108|-0.0160876|-0.1505695|100.588785 unknown
InChI: InChI=1S/C9H11N3O/c1-8(13)12(2)11-10-9-6-4-3-5-7-9/h3-7H,1-2H3
charge 0 multiplicity 1
24 atoms
O  -4.459421 0.17741 0.001758
N  -2.209866 -0.397762 0.001456
N  -0.011808 -0.836753 -0.001369
N  -0.912296 0.103145 -0.002164
C  1.346792 -0.338911 -0.00068
C  2.026035 -0.149535 1.2275
C  2.024917 -0.143716 -1.22855
C  -3.262065 0.568719 0.000916
C  -2.492896 -1.845435 0.005373
C  3.381175 0.248149 1.222061
C  3.380079 0.253891 -1.222435
C  4.063382 0.451937 -0.000022
C  -2.850025 2.029387 -0.005243
H  1.495181 -0.316718 2.170726
H  1.493215 -0.306433 -2.172083
H  -2.049128 -2.320141 -0.886256
H  -3.586205 -1.960277 0.007673
H  -2.045829 -2.315979 0.897547
H  3.902851 0.400092 2.173556
H  3.900904 0.410273 -2.173675
H  5.115017 0.757849 0.000232
H  -2.235551 2.273851 0.877307
H  -3.76645 2.637424 -0.006664
H  -2.23741 2.267032 -0.890965
