program: Gaussian 09
title: 000097612
version: EM64L-G09RevD.01
frameworkgroup: C1[X(C9H12N4O)]
method: RPBEPBE
basis: SDD
operation: Freq
keyword: #p
keyword: freq=noraman
keyword: PBEPBE/SDD
title: #p freq=noraman PBEPBE/SDD
converged: YES YES NO NO
title: Mulliken charges:
elementType: O N N N N C C C C C C C C C H H H H H H H H H H H H
charge: -0.297078 -0.040404 -0.236132 -0.027754 -0.659844 0.108413 0.136118 -0.332641 -0.301382 -0.245757 -0.211562 0.150623 -0.627022 -0.598884 0.283546 0.260826 0.230855 0.225960 0.229500 0.257519 0.257504 0.264809 0.235647 0.235750 0.394219 0.307172
chargesum: 0.00000
title: Mulliken charges with hydrogens summed into heavy atoms:
elementType: O N N N N C C C C C C C C C
charge: -0.297078 -0.040404 -0.236132 -0.027754 0.041547 0.108413 0.136118 -0.049096 -0.040556 -0.014902 0.014397 0.150623 0.117501 0.137323
polarizability: 2.31118705e+02 -1.21516268e+01 1.50500801e+02 4.50316705e-02 -3.08457257e-04 6.11300214e+01
1716.lowfreq: -10.1616 0.0002 0.0003 0.0003 0.6582 5.7134 25.7974 65.6556 82.8705
frequency: 25.7921 65.6505 82.8625 95.5077 111.5449 144.8787 174.5523 213.3894 236.4903 256.1808 314.7506 315.6729 382.7430 383.1033 426.6695 427.7144 491.1382 536.0411 588.6723 589.0796 599.3857 633.2714 690.7203 732.9870 773.2946 789.2845 819.4342 845.5300 898.2470 901.4194 985.9399 1007.3648 1036.1450 1038.3157 1056.0113 1081.2102 1084.8945 1120.1616 1128.0194 1147.8322 1168.4266 1194.2911 1253.7237 1296.1852 1325.6768 1346.5326 1357.4109 1383.8415 1417.8876 1431.0280 1441.3719 1448.8376 1465.1200 1468.9442 1483.2227 1491.3779 1558.8510 1571.1426 1597.2640 1619.3168 2971.8211 2977.5046 3051.1716 3051.2997 3118.4021 3126.9630 3129.2447 3146.7647 3162.6644 3173.1276 3243.1171 3615.4615
redmass: 3.1667 3.8468 2.2139 4.1805 2.5391 3.0270 1.1314 2.0871 4.9068 3.8172 4.7216 4.5742 6.9497 4.7534 3.1533 3.4029 4.6263 3.2848 4.9084 1.3475 5.1602 5.8971 3.3995 4.9138 2.5991 1.7836 5.0005 1.0711 5.1602 1.4403 1.3552 1.3300 1.5294 2.2099 2.7467 2.6993 1.2453 2.1877 1.3439 1.7239 1.1334 2.4129 1.8341 3.3318 4.1078 2.9718 3.9938 8.4822 1.1498 2.3953 1.2730 1.0448 2.4070 1.0451 1.0614 1.1622 1.6354 3.4411 5.0757 7.3169 1.0349 1.0359 1.1009 1.1018 1.0995 1.0978 1.0860 1.0902 1.0952 1.0973 1.0641 1.0893
irintensity: 1.0270 0.3053 8.6133 1.5547 0.1089 2.4450 2.4672 1.0460 9.4521 1.2054 15.3159 2.4790 0.3560 8.0847 13.9438 7.5664 1.7941 0.7363 9.2097 98.1817 41.2151 0.8453 92.0159 5.1459 38.4041 27.2169 12.2761 82.4280 5.9441 0.4992 3.8951 1.5046 6.7601 19.3496 101.9938 19.5229 0.0118 3.2226 0.3081 4.6767 1.8095 0.7361 4.4990 3.9734 0.2570 167.3190 330.4949 21.9033 22.0809 22.2351 32.5154 20.9492 37.8198 11.6187 7.2083 80.6139 155.4184 53.4521 71.1118 158.1411 42.7557 81.8721 0.0888 50.4255 15.6620 9.7210 6.4448 9.1942 13.8918 22.6434 345.4455 62.6604
temp: 298.150 k
press: 1.00000 atm
elementType: 8 7 7 7 7 6 6 6 6 6 6 6 6 6 1 1 1 1 1 1 1 1 1 1 1 1
symmnumber: 1
zpe: 540233.0 jmol-1
zpe.correction: 0.205764 hartree
zpe.thermalcorrener: 0.219453 hartree
zpe.thermalcorrenthalpy: 0.220397 hartree
zpe.thermalcorrgfe: 0.164494 hartree
zpe.sumelectzpe: -643.323499 hartree
zpe.sumelectthermal: -643.309810 hartree
zpe.sumelectthermalent: -643.308866 hartree
zpe.sumelectthermalfe: -643.364769 hartree
dipole: -7.8707 -1.9185 -0.0061
dipole: 8.1012
quadrupole: -68.9867 -78.4564 -86.0186
quadrupole: -14.6190 -0.0296 -0.0284
quadrupole: 8.8339 -0.6358 -8.1981 -14.6190 -0.0296 -0.0284
hfenergy: -643.529263 hartree
pointgroup: C01 [X(C9H12N4O1)]
dipole: 2.8857965 1.3396999 -0.1894965 debye
dipolederiv: -0.8572954 -0.1732555 0.0202806 -0.4360033 -0.9304031 0.1178785 0.0871538 0.1312411 -0.4098706 -1.6635943 -0.2853217 -0.0041171 0.240572 -0.1153805 -0.021057 -0.1290717 -0.0468143 -0.241825 -0.9826946 -0.1369717 -0.0099897 -1.0170012 -0.3488757 -0.0017404 0.2112745 0.0449864 -0.1409938 1.777265 0.3280837 0.01347 0.1831777 -0.2358984 0.0609032 0.0477501 0.0674673 -0.0486589 -0.9775385 0.1092357 -0.0445709 0.1195618 -0.6323105 0.0035284 -0.0472079 0.0030745 -0.6436633 -0.138784 0.0201474 -0.0125954 -0.0573712 -0.3898885 0.0970991 0.0075578 0.1013256 -0.0225511 0.7692472 0.0769322 0.0210101 -0.041528 0.0656696 -0.0171678 0.0517561 -0.0109504 0.0131372 -0.0005845 -0.0280518 0.0129839 0.1715747 -0.0059425 -0.0179745 -0.0383765 -0.0282857 -0.1062773 -0.2061858 0.0945614 -0.0278076 0.1789642 -0.1072234 0.0007265 -0.0494159 -0.0036376 -0.1424209 0.0475308 -0.0511316 0.0244308 -0.0558476 -0.127502 -0.0144076 0.0256163 -0.0143798 -0.1678193 0.0072832 -0.0289712 0.0151119 -0.0726099 0.1309523 -0.073954 0.0263578 -0.0713642 -0.1231603 1.3120147 -0.0978152 0.0799673 0.2546561 1.3187318 -0.2714814 -0.0093693 -0.2897758 0.2743603 0.1522779 -0.0371736 0.0059024 -0.1997705 0.1646335 0.0026525 0.0456944 0.0112078 0.2158267 0.4477842 0.2264185 -0.0451869 0.5170138 0.2394513 0.0308549 -0.1208423 0.0146969 0.2365897 0.0579545 -0.046491 0.0069 -0.0978023 0.1019719 0.0077889 0.020046 0.0103722 0.1508051 0.0530871 -0.0997686 0.0203092 -0.0653979 0.0194832 0.0314403 0.0115807 0.0295405 0.1488752 -0.121479 0.0596575 -0.029995 0.0512775 0.0737643 0.0250364 -0.0277603 0.0254772 0.1533027 0.055399 0.0522933 -0.0184213 0.0843758 -0.1038588 0.0697721 -0.0265111 0.0680745 0.132917 -0.1514497 0.0185113 -0.02003 -0.0149733 0.0986357 0.0055818 -0.0117013 0.007503 0.122178 0.083946 -0.070959 -0.062925 0.0777644 -0.0287337 -0.0475932 -0.0320271 -0.0833208 -0.0146975 0.0726588 -0.0375369 0.1037575 0.0820372 0.030235 0.0345859 0.0047953 0.0559557 -0.0621702 0.0961441 0.115039 -0.0319151 0.0233311 -0.012676 0.0387125 -0.0081739 0.0436247 0.1217342 -0.1247534 -0.0476147 0.1065767 -0.0408108 0.0497536 -0.0796461 0.1813874 -0.0206479 -0.0357939 -0.0964973 -0.0930271 -0.0749214 -0.131057 0.0653958 0.0055067 -0.1438369 -0.0526554 -0.0821085 0.2364282 0.155715 -0.0432859 0.2815551 0.5589153 -0.0461018 -0.0751726 -0.0526772 0.3267012 0.1518359 -0.0225055 -0.0049391 -0.0356886 0.1211 0.059056 -0.0015034 0.0599619 0.3455833 unknown
polarizability: 232.2475553|6.2487668|143.716653|7.4759673|-20.6760508|66.7853195 unknown
InChI: InChI=1S/C9H12N4O/c1-13(2)12-11-8-6-4-3-5-7(8)9(10)14/h3-6H,10H2,1-2H3
charge 0 multiplicity 1
26 atoms
O  -2.311142 -2.947641 0.69474
N  2.960998 0.576707 0.0744
N  0.811346 -0.052274 0.118515
N  1.662919 0.932485 -0.083889
N  -0.02433 -2.533312 0.703543
C  -1.572707 -0.689741 0.156435
C  -0.569484 0.315475 -0.047713
C  -2.93601 -0.331146 -0.006221
C  -0.967583 1.636324 -0.406106
C  -3.321128 0.974441 -0.359921
C  -2.32538 1.962593 -0.560523
C  -1.334686 -2.143331 0.538867
C  3.370815 -0.788674 0.442083
C  3.949947 1.638812 -0.137481
H  -3.672595 -1.124703 0.158008
H  -0.192294 2.392194 -0.558681
H  -4.380931 1.223417 -0.478793
H  -2.610518 2.984307 -0.836541
H  4.468991 -0.820317 0.511735
H  3.027032 -1.516017 -0.317521
H  2.929459 -1.078584 1.414376
H  3.406776 2.557696 -0.403312
H  4.642844 1.376406 -0.958774
H  4.540762 1.819573 0.780158
H  0.709874 -1.817236 0.558894
H  0.155726 -3.503153 0.958922
