program: Gaussian 09
title: 000097636
version: EM64L-G09RevD.01
frameworkgroup: C1[X(C13H16N2O5)]
method: RPBEPBE
basis: SDD
operation: Freq
keyword: #p
keyword: freq=noraman
keyword: PBEPBE/SDD
title: #p freq=noraman PBEPBE/SDD
converged: YES YES NO NO
title: Mulliken charges:
elementType: O O O O O N N C C C C C C C C C C C C C H H H H H H H H H H H H H H H H
charge: -0.399452 -0.242612 -0.296654 -0.419339 -0.225783 -0.460073 -0.411815 -0.133315 -0.391897 -0.484653 0.111777 0.157789 0.286230 0.179988 -0.327084 -0.367667 0.468773 -0.436298 -0.371244 -0.635043 0.309837 0.248347 0.285243 0.271304 0.255340 0.339148 0.204293 0.271786 0.215973 0.238731 0.299602 0.388165 0.377183 0.223018 0.235313 0.235088
chargesum: 0.00000
title: Mulliken charges with hydrogens summed into heavy atoms:
elementType: O O O O O N N C C C C C C C C C C C C C
charge: -0.011287 -0.242612 -0.296654 -0.042156 -0.225783 -0.120926 -0.112213 0.176523 0.141693 0.041992 0.111777 0.157789 0.286230 0.179988 -0.122791 -0.095881 0.468773 -0.220325 -0.132513 0.058376
polarizability: 2.65330669e+02 2.21133161e+01 1.21763738e+02 -1.72922793e+01 7.80357213e+00 1.61597048e+02
1716.lowfreq: -3.9259 -3.3334 -0.0007 0.0002 0.0005 5.2575 12.6558 18.6156 21.1132
frequency: 12.3497 18.5953 21.0835 40.5810 53.2011 62.3149 76.2117 88.0178 92.5306 130.4436 141.2629 171.5485 179.3524 197.9829 207.8936 246.2784 291.8076 311.7289 325.0519 379.1082 382.1336 412.2128 424.8880 454.0110 495.9472 503.0496 515.1428 534.0774 558.8751 582.3660 588.8149 610.2560 634.0183 634.6908 636.6923 683.2440 724.4710 755.4567 768.2772 781.6754 805.0089 814.0679 839.9644 874.8876 898.5091 933.3986 937.0871 990.2014 995.5096 1024.4497 1043.6937 1060.5833 1069.9079 1096.0898 1102.7347 1114.8779 1123.9521 1156.7253 1167.4523 1184.2153 1198.7902 1221.6019 1241.0630 1264.2766 1279.1642 1288.2913 1301.6428 1317.9884 1334.7092 1353.8935 1370.2566 1379.6073 1435.2815 1439.4366 1449.8036 1468.5359 1468.8741 1470.5301 1477.4953 1502.3826 1537.3801 1552.6822 1590.0313 1634.6364 1645.4158 1670.5009 2952.0527 2989.8659 2997.7664 3017.7689 3035.0321 3040.7594 3096.6969 3101.1032 3108.2403 3132.5604 3144.8637 3165.1622 3513.7045 3518.6497 3527.1704 3586.2877
redmass: 3.5161 12.8411 6.7521 7.1864 8.7484 5.7168 5.1003 3.8967 3.1166 4.3844 3.4858 1.9614 1.8869 3.4716 5.0956 4.5395 3.8449 5.4199 5.0810 1.2707 5.4759 2.6648 4.7514 3.8715 3.0380 1.7985 3.0015 4.0879 2.5707 1.2973 4.5152 4.1317 4.2163 1.6266 1.5884 3.6484 4.6197 3.6925 2.7005 2.3602 1.3963 4.2638 1.7049 4.0704 4.4893 1.5103 2.4516 1.3603 2.9490 2.8218 2.7434 2.1909 2.4292 2.6316 2.3296 1.5985 1.2792 1.8049 1.5862 1.4550 1.2377 1.4276 1.4212 1.6647 1.6576 1.2863 1.4556 1.8128 1.5082 2.4497 3.6473 1.7824 3.1735 1.1045 1.2935 1.0742 1.1420 1.6717 1.9707 1.0985 3.2792 5.2981 5.6506 6.4124 8.3793 8.2300 1.0373 1.0612 1.0814 1.1012 1.0631 1.0958 1.0964 1.1038 1.0862 1.0966 1.0873 1.0961 1.0639 1.0643 1.0770 1.0774
irintensity: 0.0412 0.7084 0.5228 4.6068 0.6245 2.1798 2.3868 0.0838 1.0221 0.1212 8.4528 5.2189 1.5366 1.4877 7.4278 3.8175 5.2779 8.0022 0.3951 101.5916 7.6254 3.3067 24.1418 19.3920 16.0462 33.9908 9.2692 64.0469 134.9309 19.4482 7.7288 3.7335 22.7869 88.6769 123.0301 49.6812 10.0184 21.6593 24.1382 23.5541 18.0571 11.4336 50.6454 7.7248 15.0843 0.6454 4.8173 0.9380 1.8470 125.8497 229.0372 135.6440 42.4233 17.9009 77.1037 8.8186 1.7353 5.2937 13.8631 6.3296 112.3424 6.4702 20.7766 83.7817 39.6055 6.9482 1.0128 38.3634 51.5014 223.9753 105.1378 79.3600 7.0012 41.2455 40.1430 21.3055 30.9757 1.5034 512.5141 67.2810 85.7821 148.7607 102.0108 341.8102 167.4375 214.6964 106.4918 10.7227 20.0260 47.2030 9.9068 6.2983 24.6804 9.6325 20.8936 23.8994 4.3601 13.5978 21.3058 46.9031 44.5850 56.6394
temp: 298.150 k
press: 1.00000 atm
elementType: 8 8 8 8 8 7 7 6 6 6 6 6 6 6 6 6 6 6 6 6 1 1 1 1 1 1 1 1 1 1 1 1 1 1 1 1
symmnumber: 1
zpe: 734404.9 jmol-1
zpe.correction: 0.279720 hartree
zpe.thermalcorrener: 0.300349 hartree
zpe.thermalcorrenthalpy: 0.301293 hartree
zpe.thermalcorrgfe: 0.225857 hartree
zpe.sumelectzpe: -989.154527 hartree
zpe.sumelectthermal: -989.133898 hartree
zpe.sumelectthermalent: -989.132954 hartree
zpe.sumelectthermalfe: -989.208389 hartree
dipole: 3.6676 -0.5416 -4.5160
dipole: 5.8429
quadrupole: -73.2248 -113.8763 -123.9050
quadrupole: 11.6986 1.8782 -4.6747
quadrupole: 30.4439 -10.2076 -20.2363 11.6986 1.8782 -4.6747
hfenergy: -989.4342466 hartree
pointgroup: C01 [X(C13H16N2O5)]
dipole: -1.4491404 0.255411 -1.7660869 debye
polarizability: 263.6630783|25.9869592|124.27066|18.9232161|-9.1359998|160.7577165 unknown
InChI: InChI=1S/C13H16N2O5/c1-14-9-4-2-8(3-5-9)12(18)15-10(13(19)20)6-7-11(16)17/h2-5,10,14-16,19H,6-7H2,1H3
charge 0 multiplicity 1
36 atoms
O  3.94236 2.640255 0.151895
O  2.220349 2.598353 -1.403547
O  0.070231 0.073867 2.17656
O  4.171035 -2.757774 -1.624845
O  4.453252 -2.57976 0.672626
N  0.737403 0.879393 0.113047
N  -5.548301 -0.628355 -0.989176
C  2.082015 1.174665 0.615622
C  2.977331 -0.094598 0.768308
C  3.177675 -0.843811 -0.55922
C  2.71185 2.196153 -0.322376
C  -0.22584 0.344326 0.963288
C  -1.588528 0.107767 0.397844
C  3.985666 -2.11408 -0.388503
C  -1.934952 0.278636 -0.972867
C  -2.60356 -0.324875 1.290812
C  -4.260647 -0.393507 -0.520397
C  -3.239188 0.034578 -1.426109
C  -3.91439 -0.571755 0.854629
C  -6.656293 -1.070567 -0.144674
H  1.999896 1.622129 1.626336
H  3.949696 0.207988 1.193937
H  2.482963 -0.747812 1.506472
H  2.201361 -1.117011 -1.003985
H  3.692033 -0.221054 -1.31764
H  0.5025 1.247567 -0.811965
H  -1.187964 0.588674 -1.713929
H  -2.327296 -0.462239 2.341758
H  -3.481634 0.167933 -2.488034
H  -4.669389 -0.902324 1.574248
H  -5.726404 -0.480073 -1.980815
H  4.327878 3.302422 -0.483691
H  4.699501 -3.589462 -1.480695
H  -7.561963 -1.181543 -0.763081
H  -6.446596 -2.049473 0.331359
H  -6.878951 -0.340133 0.658908
