program: Gaussian 09
title: 000097598
version: EM64L-G09RevD.01
frameworkgroup: C1[X(C15H11N)]
method: RPBEPBE
basis: SDD
operation: Freq
keyword: #pfreq=noraman
keyword: PBEPBE/SDD
title: #p freq=noraman PBEPBE/SDD
converged: NO NO NO NO
title: Mulliken charges:
elementType: N C C C C C C C C C C C C C C C H H H H H H H H H H H
charge: -0.435376 0.097916 -0.029220 -0.649522 0.282817 0.307415 0.166536 0.224163 -0.428796 -0.421441 -0.412501 -0.379590 -0.238772 -0.241160 -0.250750 -0.221550 0.245421 0.245425 0.306616 0.236440 0.241995 0.233577 0.230481 0.224683 0.225002 0.219430 0.220763
chargesum: 0.00000
title: Mulliken charges with hydrogens summed into heavy atoms:
elementType: N C C C C C C C C C C C C C C C
charge: -0.128760 0.097916 -0.029220 -0.158677 0.282817 0.307415 0.166536 0.224163 -0.192357 -0.179446 -0.178925 -0.149110 -0.014088 -0.016158 -0.031319 -0.000788
polarizability: 3.12589224e+02 -6.86109930e+00 1.65458231e+02 -3.20613728e-03 2.90176590e-03 6.76424033e+01
1716.lowfreq: -0.0010 -0.0003 0.0010 7.9305 8.4653 18.5287 66.1379 122.6327 152.4626
frequency: 66.1169 122.6307 152.4588 180.4086 231.5134 297.1074 302.7840 322.0833 393.8377 419.8619 437.0776 496.4746 519.9395 541.2286 552.8070 573.3311 583.1257 621.5070 664.5782 671.9986 722.7418 748.2032 754.8022 761.1293 766.9507 783.2980 828.3862 848.6124 862.6437 906.8664 920.9910 929.9353 956.8943 970.1238 981.0112 1009.4667 1014.9915 1030.8415 1088.0293 1114.8722 1119.1921 1147.0727 1161.6763 1167.9976 1182.7433 1187.9056 1236.1040 1244.9316 1285.1646 1322.5599 1368.0777 1386.3758 1407.1934 1422.5348 1435.1881 1440.2733 1462.0604 1486.6428 1516.8185 1525.4945 1579.8813 1593.8953 1621.8747 1627.5997 2989.9084 3038.6930 3119.6534 3122.4760 3126.0643 3130.7908 3140.2079 3144.6799 3160.2007 3161.4634 3612.7539
redmass: 5.2994 3.7368 4.7399 3.9495 2.9201 3.3387 5.6647 4.5020 5.1902 2.7845 2.9448 1.2428 2.9155 4.6386 6.2454 3.5787 5.5762 6.7592 3.9747 6.1790 1.9598 1.3244 3.7670 4.9921 1.8229 5.1360 5.0241 1.4398 1.3361 6.3538 1.6314 1.4033 1.7476 1.3074 1.3266 2.2361 2.8174 2.8197 2.5813 1.6516 1.1329 2.2122 1.4875 1.1647 1.5075 1.4846 1.6592 2.1226 1.5034 1.9065 3.7373 4.1017 2.2756 1.7589 1.7412 2.3899 3.8476 4.1317 6.0762 6.2833 6.1080 6.6100 7.7292 7.4000 1.0595 1.1007 1.0855 1.0848 1.0896 1.0891 1.0943 1.0952 1.1002 1.1002 1.0805
irintensity: 0.6884 0.3066 0.7572 1.6056 0.9561 6.3495 0.0343 2.8491 0.2534 0.0308 16.4228 88.7028 10.6910 6.0617 3.6177 1.8794 2.0041 4.5704 1.7299 1.0124 14.5788 144.4324 11.2306 0.6715 43.4141 0.1174 1.6314 0.0931 0.8186 0.8413 0.0949 4.3819 3.5419 0.0289 0.0413 5.5401 10.0446 5.4544 9.8863 1.4708 0.3467 13.3580 0.9399 0.9532 2.5329 1.1673 7.0835 30.8151 0.8216 43.3577 13.0723 4.4025 32.6507 5.2080 26.6074 3.3961 18.7154 0.9221 14.7280 5.6812 2.2808 2.2956 23.6756 11.8860 19.0462 9.0243 7.1014 1.2760 1.9402 4.1228 31.7706 34.6622 50.7812 30.4999 49.2199
temp: 298.150 k
press: 1.00000 atm
elementType: 7 6 6 6 6 6 6 6 6 6 6 6 6 6 6 6 1 1 1 1 1 1 1 1 1 1 1
symmnumber: 1
zpe: 561214.9 jmol-1
zpe.correction: 0.213755 hartree
zpe.thermalcorrener: 0.224929 hartree
zpe.thermalcorrenthalpy: 0.225873 hartree
zpe.thermalcorrgfe: 0.176884 hartree
zpe.sumelectzpe: -631.893233 hartree
zpe.sumelectthermal: -631.882059 hartree
zpe.sumelectthermalent: -631.881115 hartree
zpe.sumelectthermalfe: -631.930104 hartree
dipole: 0.6847 -1.0920 0.0000
dipole: 1.2890
quadrupole: -86.1480 -75.0924 -100.0432
quadrupole: 2.1269 -0.0006 0.0003
quadrupole: 0.9465 12.0021 -12.9487 2.1269 -0.0006 0.0003
hfenergy: -632.1069884 hartree
pointgroup: C01 [X(C15H11N1)]
dipole: -0.271048 -0.4286012 -0.0000106 debye
polarizability: 312.639807|6.2952225|165.4076483|-0.0032173|-0.0028894|67.6424033 unknown
InChI: InChI=1S/C15H11N/c1-2-6-11-10(5-1)9-13-12-7-3-4-8-14(12)16-15(11)13/h1-8,16H,9H2
charge 0 multiplicity 1
27 atoms
N  0.747204 -1.531505 0.000025
C  0.311708 0.718904 -0.000051
C  -0.255353 -0.561685 -0.000036
C  -0.778216 1.771776 -0.000073
C  -1.713379 -0.495405 0.000023
C  -2.051224 0.903029 -0.000051
C  1.743167 0.563321 0.000011
C  1.992025 -0.868312 0.000031
C  -2.724594 -1.482184 0.000127
C  -3.396136 1.301506 -0.00001
C  2.85575 1.448188 0.000026
C  3.296245 -1.405288 0.000021
C  -4.07829 -1.066795 0.000197
C  -4.41375 0.308955 0.000133
C  4.158363 0.911664 0.000047
C  4.377316 -0.497738 0.000018
H  -0.744951 2.424113 -0.893455
H  -0.74497 2.424249 0.893206
H  0.620475 -2.540693 -0.000024
H  -2.478918 -2.550502 0.000169
H  -3.6642 2.364585 -0.000044
H  2.703408 2.533169 0.000016
H  3.471681 -2.487078 0.000041
H  -4.876798 -1.817347 0.000286
H  -5.467761 0.608622 0.000192
H  5.021553 1.586871 0.000051
H  5.402945 -0.883722 0.000021
