program: Gaussian 09
title: 000097347
version: EM64L-G09RevD.01
frameworkgroup: C1[X(C7H7NO)]
method: RPBEPBE
basis: SDD
operation: Freq
keyword: #pfreq=noraman
keyword: PBEPBE/SDD
title: #p freq=noraman PBEPBE/SDD
converged: NO NO NO NO
title: Mulliken charges:
elementType: O N C C C C C C C H H H H H H H
charge: -0.202672 -0.207299 -0.376127 -0.507664 0.332627 0.030833 -0.220846 -0.362272 -0.266773 0.245479 0.245504 0.257847 0.257829 0.254858 0.269724 0.248951
chargesum: 0.00000
title: Mulliken charges with hydrogens summed into heavy atoms:
elementType: O N C C C C C C C
charge: -0.202672 -0.207299 0.114856 0.008012 0.332627 0.030833 0.034013 -0.092548 -0.017822
polarizability: 1.14048116e+02 2.99852596e+00 8.89506207e+01 2.16975613e-03 -3.85460764e-04 4.20410141e+01
1716.lowfreq: -0.0005 -0.0004 0.0007 1.5714 20.4831 22.4842 90.3364 164.2744 200.5636
frequency: 90.1076 164.2680 200.5615 295.6928 505.3786 516.9079 588.0695 600.6942 633.9137 655.6943 721.2759 748.6582 807.9817 839.2359 892.8195 893.5304 986.3829 996.9205 1024.1122 1024.1933 1055.4297 1132.6954 1169.1719 1208.3671 1222.3063 1253.2968 1286.4711 1310.5796 1387.2781 1414.9872 1442.6801 1450.9549 1495.2297 1530.5332 1645.5060 3009.4807 3030.4381 3063.5913 3094.5308 3206.9091 3226.0827 3241.3081
redmass: 1.8739 4.9351 3.5989 6.5886 3.9321 3.1253 9.0043 3.0312 5.3886 2.9375 5.9921 1.2345 1.2887 1.5326 4.9755 1.3584 2.7840 2.5562 1.7452 1.7989 1.8692 2.6185 1.2020 1.0840 1.4947 1.5357 1.9748 2.7689 5.2284 4.2280 1.1043 2.4957 1.2344 6.8537 12.2830 1.0578 1.0610 1.1073 1.1038 1.0905 1.0989 1.1067
irintensity: 1.0120 0.3298 7.5838 4.1602 1.7560 0.7221 4.6967 7.0540 13.1645 3.8355 9.3885 101.2681 18.3835 1.2437 2.0882 1.2520 3.9705 10.9313 24.1882 2.3675 61.2621 3.3883 0.1050 0.1468 5.2451 2.8467 57.7789 49.9169 60.8628 1.7256 14.0864 18.6062 13.2764 29.8970 411.5564 42.7845 13.9624 10.0349 15.4863 2.6872 1.2793 3.1768
temp: 298.150 k
press: 1.00000 atm
elementType: 8 7 6 6 6 6 6 6 6 1 1 1 1 1 1 1
symmnumber: 1
zpe: 329357.2 jmol-1
zpe.correction: 0.125446 hartree
zpe.thermalcorrener: 0.132443 hartree
zpe.thermalcorrenthalpy: 0.133387 hartree
zpe.thermalcorrgfe: 0.093744 hartree
zpe.sumelectzpe: -400.265199 hartree
zpe.sumelectthermal: -400.258201 hartree
zpe.sumelectthermalent: -400.257257 hartree
zpe.sumelectthermalfe: -400.296901 hartree
dipole: 2.0587 4.4486 0.0000
dipole: 4.9019
quadrupole: -53.6287 -49.6689 -53.6725
quadrupole: -7.5683 0.0013 0.0015
quadrupole: -1.3053 2.6544 -1.3491 -7.5683 0.0013 0.0015
hfenergy: -400.3906441 hartree
pointgroup: C01 [X(C7H7N1O1)]
dipole: 0.8929883 1.7093639 0.0000132 debye
dipolederiv: -1.0510395 -0.3122147 0.0000358 -0.5431138 -0.8160598 0.0000771 0.0000863 0.0001026 -0.338073 -0.0160353 0.4315552 0.0000463 0.5092699 -0.4234763 0.0000353 -0.0002301 0.000416 -0.1167444 0.2384196 -0.2421194 -0.0001723 -0.1378973 0.3839218 0.0000281 0.0000214 -0.0001827 0.3083501 -0.0487952 0.1786951 -0.0000395 0.0948517 -0.4629499 0.0001679 -0.0002088 0.0002727 0.1061051 -1.2077392 -0.1421449 -0.0000243 -0.0202064 0.1254446 -0.0000001 0.0001051 -0.0000565 -0.0379305 1.7973605 0.2509326 -0.0000149 0.243655 1.0774263 -0.0002321 -0.0000223 -0.0002728 0.1582565 -0.1705277 -0.2773135 0.0000344 0.0820534 0.1578696 -0.0000369 0.000027 -0.0001744 -0.1521507 0.3148857 0.1445978 0.0000585 -0.0127408 -0.0038406 -0.0000009 0.0000915 0.0000314 -0.1839621 -0.1051294 -0.0324039 -0.0000201 -0.2969742 -0.1863706 -0.0000497 -0.000071 -0.0000213 -0.2459422 0.0340535 0.0085644 0.0266758 0.024288 -0.0460194 0.0782008 0.0085996 0.1417963 -0.0430689 0.0339604 0.0087799 -0.0266468 0.0243468 -0.0457675 -0.0781311 -0.0085004 -0.1418207 -0.0434464 0.0282494 -0.0072057 -0.0698494 0.0229382 0.0818981 0.0289398 -0.1086122 0.0446568 -0.0103367 0.0280318 -0.0070877 0.0699353 0.0230312 0.0819021 -0.0289888 0.1087158 -0.0447568 -0.010033 0.0767566 -0.0348091 -0.0000155 -0.070748 -0.0065136 -0.0000023 -0.0000001 0.0000165 0.2087845 0.1131969 -0.0188263 -0.0000028 0.002955 -0.0126281 -0.0000059 -0.0000249 -0.0000131 0.2026339 -0.065648 0.0510001 -0.0000006 0.0542913 0.0951634 -0.0000011 0.0000231 0.000006 0.1975578 unknown
polarizability: 114.2777141|1.7821668|88.7210232|0.0021488|-0.0004891|42.0410141 unknown
InChI: InChI=1S/C7H7NO/c9-7-3-5-8-4-1-2-6(7)8/h1-2,4H,3,5H2
charge 0 multiplicity 1
16 atoms
O  -2.256648 -1.415898 0.000213
N  0.561014 0.776856 -0.000053
C  -0.465399 1.847893 0.000502
C  -1.807808 1.04983 -0.000333
C  0.032366 -0.520389 -0.000022
C  -1.42753 -0.467048 0.000006
C  1.937571 0.728236 0.000081
C  1.112812 -1.429384 0.000064
C  2.308982 -0.641884 0.000133
H  -0.35406 2.483982 -0.895133
H  -0.354466 2.48252 0.897237
H  -2.422127 1.265739 -0.891283
H  -2.423498 1.266008 0.889589
H  2.557035 1.624017 0.00012
H  1.037287 -2.514678 0.000045
H  3.332168 -1.0154 0.000134
