program: Gaussian 09
title: 000010946
version: EM64L-G09RevD.01
frameworkgroup: C1[X(C4H4Cl2O3)]
method: RPBEPBE
basis: SDD
operation: Freq
keyword: #p
keyword: freq=noraman
keyword: PBEPBE/SDD
title: #p freq=noraman PBEPBE/SDD
converged: YES YES NO NO
title: Mulliken charges:
elementType: Cl Cl O O O C C C C H H H H
charge: 0.005314 0.005323 -0.319604 -0.116273 -0.116276 -0.682896 -0.682891 0.358059 0.358059 0.297733 0.297857 0.297750 0.297845
chargesum: 0.00000
title: Mulliken charges with hydrogens summed into heavy atoms:
elementType: Cl Cl O O O C C C C
charge: 0.005314 0.005323 -0.319604 -0.116273 -0.116276 -0.087306 -0.087295 0.358059 0.358059
polarizability: 1.12482404e+02 6.70292250e-04 6.27269204e+01 1.28633060e-01 -2.30265781e-02 3.62048395e+01
1716.lowfreq: -41.6157 -15.1849 -7.9431 -3.5938 -0.0026 -0.0025 -0.0020 29.3233 46.5939
frequency: -41.6067 29.2340 46.5909 80.0763 106.2960 191.9446 218.2750 260.4106 327.6811 493.5987 534.1404 543.1214 664.5699 737.0566 745.1974 791.4323 876.1988 908.6413 911.8719 968.3473 1059.5678 1152.5493 1152.7485 1272.1577 1277.1696 1414.5991 1417.0038 1696.3734 1762.4106 3057.2758 3058.0063 3132.1400 3132.3238
redmass: 4.8825 6.7416 3.9316 14.1394 4.9459 11.6211 15.7782 13.6704 12.1160 2.7397 2.8949 13.2680 8.8207 6.9672 7.6091 9.5320 9.2891 1.8287 1.7955 5.0767 4.3380 1.1104 1.1140 1.2930 1.3581 1.0821 1.0831 11.5948 11.6995 1.0570 1.0572 1.1069 1.1070
irintensity: 0.0012 6.8371 0.0019 0.4907 7.1168 1.5990 0.2856 0.9425 0.4104 0.0015 3.8157 18.1150 17.1084 21.8578 0.0417 5.9591 531.1289 19.4719 0.0014 768.3077 1.4953 0.1747 0.0012 9.0241 14.9054 5.8212 57.8648 60.7856 247.7065 20.0012 0.4617 0.0030 1.1604
temp: 298.150 k
press: 1.00000 atm
elementType: 17 17 8 8 8 6 6 6 6 1 1 1 1
symmnumber: 1
zpe: 203478.9 jmol-1
zpe.correction: 0.077501 hartree
zpe.thermalcorrener: 0.086859 hartree
zpe.thermalcorrenthalpy: 0.087803 hartree
zpe.thermalcorrgfe: 0.039866 hartree
zpe.sumelectzpe: -1299.910196 hartree
zpe.sumelectthermal: -1299.900839 hartree
zpe.sumelectthermalent: -1299.899894 hartree
zpe.sumelectthermalfe: -1299.947831 hartree
dipole: -0.0005 -5.2140 0.0062
dipole: 5.2140
quadrupole: -78.1750 -68.7096 -61.9214
quadrupole: 0.0002 -0.1173 -0.0005
quadrupole: -8.5730 0.8924 7.6806 0.0002 -0.1173 -0.0005
hfenergy: -1299.9876972 hartree
pointgroup: C01 [X(C4H4Cl2O3)]
dipole: -0.0001569 -2.05136 0.0015936 debye
dipolederiv: -0.479095 -0.0037312 -0.0008182 -0.079994 -0.113634 -0.0002987 -0.0018438 0.0000911 -0.1200621 -0.4790637 0.0037277 -0.0013054 0.0799835 -0.1136305 0.0004567 -0.0026498 -0.0000884 -0.120061 -2.8878249 -0.0000246 -0.0000065 -0.0000731 -0.589875 0.0000556 0.0041014 -0.0000514 -0.2307583 -0.6235694 -0.0081767 0.0007071 -0.4183323 -0.7532361 -0.0035643 -0.0003055 -0.0033475 -0.2337392 -0.6235847 0.0081537 0.0005976 0.418363 -0.7532071 0.0027808 -0.0010968 0.0038518 -0.233734 0.5051849 0.1668601 0.0034674 0.3991007 -0.1083668 -0.0023395 0.0077082 -0.003585 0.1460334 0.5051317 -0.1668409 0.0044768 -0.3990637 -0.1083541 0.0016038 0.0081758 0.0028926 0.1460579 2.096803 0.0494189 -0.0026019 0.5683547 1.0971031 0.0058918 -0.0053493 0.0059632 0.2506717 2.0968292 -0.0493772 -0.0017557 -0.5683334 1.0970596 -0.0048255 -0.0039725 -0.0060431 0.2506549 -0.0276699 -0.0442409 0.0415619 -0.0457223 0.085065 0.0582883 0.0249436 0.068084 0.0377979 -0.0277406 -0.0424938 -0.0428263 -0.0444047 0.0880035 -0.0570397 -0.0271952 -0.066476 0.0346708 -0.027928 0.044398 0.0414382 0.0458894 0.0850742 -0.058165 0.0248086 -0.0679192 0.0380466 -0.0274724 0.0423269 -0.0429351 0.0442323 0.0879983 0.0571558 -0.0273247 0.0666279 0.0344214 unknown
polarizability: 112.4823661|0.0011854|62.7269349|0.1394681|-0.0121096|36.2048631 unknown
InChI: InChI=1S/C4H4Cl2O3/c5-1-3(7)9-4(8)2-6/h1-2H2
charge 0 multiplicity 1
13 atoms
Cl 4.048261 -0.306418 0.000999
Cl -4.048284 -0.306487 -0.004698
O  0.000016 -0.505443 0.001502
O  1.452854 1.388227 0.006992
O  -1.452831 1.388191 -0.005824
C  2.310556 -0.95169 -0.009738
C  -2.310607 -0.951748 0.010209
C  1.28304 0.173095 0.00151
C  -1.283057 0.173053 0.001221
H  2.18035 -1.586236 0.879844
H  2.183836 -1.564199 -0.915278
H  -2.178345 -1.586498 -0.878921
H  -2.185991 -1.564048 0.916182
