program: Gaussian 09
title: 000097239
version: EM64L-G09RevD.01
frameworkgroup: C1[X(C9H10N2O4)]
method: RPBEPBE
basis: SDD
operation: Freq
keyword: #p
keyword: freq=noraman
keyword: PBEPBE/SDD
title: #p freq=noraman PBEPBE/SDD
converged: YES YES NO NO
title: Mulliken charges:
elementType: O O O O N N C C C C C C C C C H H H H H H H H H H
charge: -0.302364 -0.244310 -0.219295 -0.201622 -0.442111 0.015495 0.368091 0.146492 -0.473584 0.429816 -0.277523 -0.411783 0.217749 -0.795774 -0.527262 0.361702 0.251954 0.287086 0.350084 0.239695 0.270545 0.238076 0.234632 0.234670 0.249541
chargesum: 0.00000
title: Mulliken charges with hydrogens summed into heavy atoms:
elementType: O O O O N N C C C C C C C C C
charge: -0.302364 -0.244310 -0.219295 -0.201622 -0.092026 0.015495 0.368091 0.146492 -0.111882 0.429816 -0.025569 -0.124697 0.217749 -0.047458 0.191579
polarizability: 1.90377796e+02 -5.83865565e+00 1.67235137e+02 3.58182709e-02 4.69578315e-02 5.95644353e+01
1716.lowfreq: -71.5796 -6.8414 -6.3228 -0.0006 0.0003 0.0007 2.5573 50.3818 67.1835
frequency: -71.5755 50.3758 67.1621 71.8728 95.3312 108.4351 139.2145 168.0011 214.3745 240.1421 244.3519 300.4675 311.7793 347.9906 355.4358 462.3090 478.4146 521.9051 547.9110 557.3209 590.7493 613.8599 649.3141 697.5511 718.8439 738.7630 754.0360 778.6787 817.1733 909.5339 936.5374 956.3473 968.1195 988.0981 996.2912 1033.5949 1072.9727 1116.6203 1129.2107 1154.0841 1198.1561 1212.6904 1228.9208 1254.5823 1274.7023 1364.4918 1377.3943 1401.7295 1428.3449 1444.1044 1446.7814 1467.1440 1468.4946 1470.3130 1484.9376 1516.5866 1601.4165 1607.6290 1636.4735 2976.9333 2989.6284 3072.4283 3074.6234 3137.2520 3137.8531 3167.5421 3191.6433 3201.0266 3506.4324
redmass: 1.0385 12.2910 5.4947 3.8986 3.7427 6.0999 5.2743 4.2007 1.4786 6.9888 2.2795 5.5373 4.4921 5.0194 6.6288 3.3702 6.1981 5.0783 4.1408 5.2540 3.5277 6.6249 5.2420 3.3203 1.3739 8.4772 3.8659 6.2350 1.5257 3.9624 5.3287 1.3460 1.3746 8.8412 1.7781 1.6710 1.9969 1.2559 1.5924 1.4801 2.4213 5.2559 3.7180 1.5369 2.5896 11.5144 1.2354 3.7487 2.3504 1.9285 1.1480 1.0469 1.0496 1.2111 1.7279 2.6142 6.2330 7.9063 5.5398 1.0320 1.0383 1.1049 1.0982 1.1010 1.0982 1.0887 1.0958 1.0930 1.0764
irintensity: 0.2065 0.2041 3.9223 1.6170 1.7881 0.8903 11.5128 2.8561 0.0145 6.6453 0.6381 1.2249 0.1669 0.2386 0.8310 6.2231 11.4076 13.6475 0.5066 8.1284 0.1366 23.7092 2.1047 1.6387 106.1940 4.0941 2.9416 17.5124 41.3578 1.7191 7.7841 0.1955 40.1101 66.1865 27.0285 8.5472 70.9105 0.0903 63.1110 2.8041 101.2357 290.5177 151.8758 22.2122 168.1174 86.2811 46.8606 150.3400 58.8338 63.6623 65.9456 22.7088 13.7027 77.2989 24.3649 450.8954 58.1867 103.8537 77.0900 58.3524 6.7778 32.5844 15.4121 15.4615 6.4742 7.1345 3.5669 23.6154 45.1828
temp: 298.150 k
press: 1.00000 atm
elementType: 8 8 8 8 7 7 6 6 6 6 6 6 6 6 6 1 1 1 1 1 1 1 1 1 1
symmnumber: 1
zpe: 485943.6 jmol-1
zpe.correction: 0.185086 hartree
zpe.thermalcorrener: 0.198794 hartree
zpe.thermalcorrenthalpy: 0.199738 hartree
zpe.thermalcorrgfe: 0.143785 hartree
zpe.sumelectzpe: -758.176464 hartree
zpe.sumelectthermal: -758.162756 hartree
zpe.sumelectthermalent: -758.161812 hartree
zpe.sumelectthermalfe: -758.217765 hartree
dipole: -7.4781 7.6248 -0.0047
dipole: 10.6798
quadrupole: -91.9357 -82.0664 -87.4730
quadrupole: 3.9929 0.0066 0.0206
quadrupole: -4.7773 5.0920 -0.3146 3.9929 0.0066 0.0206
hfenergy: -758.3615499 hartree
pointgroup: C01[X(C9H10N2O4)]
dipole: 3.0535643 2.8478868 -0.4692672 debye
dipolederiv: -1.1745253 -0.8862531 0.1452691 -0.6244517 -1.057724 0.1234166 0.108042 0.1290861 -0.3072946 -0.5298877 -0.3260282 0.0493874 0.248513 -0.9977735 0.0880178 -0.0295058 0.0980913 -0.3460383 -1.046039 0.0473783 0.0090077 0.1319075 -0.4468024 0.0282105 -0.0032497 0.0297216 -0.2421388 -0.5440061 -0.1073407 0.0219945 -0.2273414 -0.8515073 0.0964773 0.0393121 0.0937668 -0.2382488 -1.066778 0.6508896 -0.0765759 0.9304427 -1.3135481 0.1202735 -0.1156161 0.1257557 -0.3339562 1.8402063 0.3536612 -0.0840602 0.4332132 1.2278581 -0.1619437 -0.0955288 -0.1597349 0.2082164 0.8263885 -0.81361 0.1007774 -0.8117921 -0.005984 0.0302172 0.1022537 0.0299976 0.0848337 1.0212501 0.9222025 -0.1517088 0.6472696 0.3698132 -0.0584739 -0.1123314 -0.064132 0.0677712 0.0628006 0.3916641 -0.0600045 -0.1172965 -0.0828402 -0.0038015 0.0131642 -0.0139501 -0.1252022 -0.5915192 -0.4296664 0.0746417 -0.3651781 -0.2130332 0.0440156 0.065147 0.0457868 0.031146 -0.4165701 -0.2948069 0.0473116 0.061024 0.084716 -0.0378332 -0.0038549 -0.0308377 -0.1644736 0.023873 0.1769728 -0.0279926 0.3060716 0.1103201 -0.0398938 -0.0470383 -0.0375332 -0.1167334 1.0748145 -0.0645599 -0.010278 -0.8596028 1.9014612 -0.2229323 0.09725 -0.2365224 0.2076149 -0.4832682 0.1723588 -0.0113882 0.0527928 -0.0353196 0.0127955 0.0115655 0.0071523 0.0514359 0.2686098 0.1088261 -0.0147803 0.4113984 0.8825753 -0.090453 -0.0583099 -0.0842677 0.3249602 0.1986194 -0.0349456 0.0048442 -0.0179732 0.15318 0.0062421 0.0021872 0.0064883 0.1924156 0.0915687 -0.0210339 0.0045002 -0.02163 -0.0773449 0.0351451 0.0045551 0.0351831 0.1583177 0.0626045 0.0496791 -0.0049246 0.0242586 0.107113 0.009324 -0.0013119 0.0089659 0.1741225 0.1806017 0.000132 0.0025187 -0.0467968 0.2544115 0.0081194 0.0082025 0.0074075 0.3062828 0.0389695 0.010256 0.0408964 -0.0165336 0.0849529 0.0813773 0.0843 0.0498002 -0.0544003 0.0881663 -0.0051551 0.001663 0.0637252 -0.0626202 0.0294848 -0.0107683 0.0315013 0.1276748 0.0325924 -0.0074209 -0.0447995 -0.0487581 0.0322933 -0.1090346 -0.0794781 -0.0777793 0.0030721 0.0777504 0.1154396 0.0872001 -0.0528109 -0.0775126 -0.0336365 0.0594915 -0.085813 -0.0536353 0.0716258 0.0884803 -0.1219841 -0.0669458 -0.0436742 0.0339912 -0.0478638 0.0797191 -0.081719 -0.1078478 -0.0971197 0.0184847 -0.0335055 0.0569897 0.0108945 0.0093863 0.0121468 0.125977 unknown
polarizability: 190.7318274|4.5045199|164.6442138|-3.3974066|-15.1325448|61.8013277 unknown
InChI: InChI=1S/C9H10N2O4/c1-6(12)10-8-5-7(11(13)14)3-4-9(8)15-2/h3-5,10H,1-2H3
charge 0 multiplicity 1
25 atoms
O  1.966537 1.94925 -0.375075
O  1.410724 -2.899602 0.322271
O  -4.093637 -0.030109 0.031104
O  -2.96767 -1.996186 0.296164
N  1.9863 -0.649619 -0.001911
N  -2.999985 -0.719171 0.110383
C  0.71037 -0.045961 -0.062716
C  0.693454 1.375231 -0.266527
C  -0.513276 -0.736332 0.061469
C  -1.715095 0.003472 -0.020347
C  -0.521369 2.08646 -0.34465
C  -1.743986 1.398046 -0.220719
C  2.291207 -2.004745 0.180474
C  3.789726 -2.298987 0.189147
C  2.06065 3.398952 -0.585576
H  -0.526897 -1.816125 0.216966
H  -0.525302 3.168267 -0.500781
H  -2.704412 1.91531 -0.276289
H  2.765475 0.007338 -0.10843
H  4.256456 -2.021637 -0.774164
H  3.934761 -3.375694 0.355859
H  4.304324 -1.740592 0.992875
H  1.607157 3.948603 0.259995
H  1.572871 3.690669 -1.534133
H  3.137515 3.613161 -0.63719
