program: Gaussian 09
title: 000097158
version: EM64L-G09RevD.01
frameworkgroup: C1[X(C10H13N3O2)]
method: RPBEPBE
basis: SDD
operation: Freq
keyword: #p
keyword: freq=noraman
keyword: PBEPBE/SDD
title: #p freq=noraman PBEPBE/SDD
converged: YES YES NO NO
title: Mulliken charges:
elementType: O O N N N C C C C C C C C C C H H H H H H H H H H H H H
charge: -0.235824 -0.232720 -0.119543 -0.089078 0.027948 -0.405043 -0.371765 -0.379087 -0.389434 -0.403402 0.238356 -0.274001 -0.269942 -0.435395 0.339634 0.228716 0.193683 0.208129 0.213947 0.216825 0.209197 0.220939 0.211349 0.287106 0.206702 0.225353 0.288237 0.289113
chargesum: 0.00000
title: Mulliken charges with hydrogens summed into heavy atoms:
elementType: O O N N N C C C C C C C C C C
charge: -0.235824 -0.232720 -0.119543 -0.089078 0.027948 0.017356 0.050311 0.046934 0.042855 0.090406 0.238356 -0.048648 0.018295 -0.146282 0.339634
polarizability: 2.66573498e+02 -1.07750532e+00 1.32332145e+02 1.21513365e+01 2.79566574e-01 7.77552381e+01
1716.lowfreq: -22.5300 -1.4396 -0.0009 -0.0007 -0.0004 5.2989 28.6905 44.6474 74.8005
frequency: 25.9032 44.4201 74.7959 87.2588 121.2845 195.8874 234.8943 253.1852 285.9224 295.9443 395.8686 416.6454 421.0687 428.5820 470.0604 490.9128 522.6548 526.0350 609.4556 626.8015 670.5368 711.1032 756.7278 786.1084 799.0516 812.2937 826.2247 845.5673 898.8325 927.5780 946.4815 953.7949 970.5473 986.8040 1011.1974 1042.2646 1083.1704 1103.7536 1116.5514 1138.6915 1142.6532 1157.6493 1211.4364 1231.0557 1249.5542 1260.9215 1275.2080 1286.1606 1321.0028 1330.1526 1337.2400 1342.7782 1346.7499 1355.6244 1357.1770 1392.0621 1422.8684 1457.4549 1463.8402 1465.2332 1469.2516 1476.8266 1499.1665 1548.2028 1600.4181 2959.5455 2963.5122 2972.4169 2989.5709 2992.3004 3041.5488 3051.3254 3059.9078 3103.8375 3108.2524 3160.4481 3168.8627 3188.2496
redmass: 4.2531 4.5202 5.7800 6.3689 3.9734 3.2808 3.5517 4.1350 3.1713 3.4083 1.8988 3.4607 4.0928 3.1622 4.6110 2.4893 3.7575 3.0700 3.4245 7.8562 6.3064 5.9297 4.6810 9.3627 1.5833 1.6532 2.7004 1.4990 2.5116 2.9932 1.3368 1.4265 3.8021 1.3262 2.5091 2.0596 1.5249 2.3099 2.7832 2.1351 1.6467 1.3265 1.9043 4.2563 1.3919 1.3880 1.1739 1.7184 1.8470 1.5724 1.4481 1.4828 1.6274 2.3312 1.9080 2.7522 3.4289 1.0918 1.1009 1.1176 1.0891 1.1720 3.5418 5.8440 6.7790 1.0701 1.0710 1.0643 1.0610 1.0612 1.0963 1.1027 1.1033 1.0916 1.0931 1.0925 1.0879 1.0972
irintensity: 0.1503 0.5011 1.9994 0.0253 0.8267 0.3393 4.5516 1.0860 2.8008 1.2538 5.0680 3.2729 0.0541 1.2159 1.2577 3.2019 5.8524 3.4095 5.8505 0.2129 14.0977 11.9844 3.4951 0.1888 6.0254 32.4998 2.7321 20.4061 5.8134 35.1978 6.6835 9.8702 11.7499 3.7801 36.1964 10.8046 0.7972 5.9495 7.4091 35.3258 14.9830 19.7372 109.0772 877.3508 1.9024 1.5302 9.4471 16.7052 12.7168 10.5447 6.5255 8.8202 17.7523 48.1321 17.6459 4.7824 64.8034 10.9325 23.7078 33.2852 12.3277 17.5996 87.0870 69.4558 552.2377 24.6413 82.1172 51.3839 28.4543 28.9974 60.9566 29.1142 89.0278 17.9464 4.6900 0.7330 5.1267 8.2980
temp: 298.150 k
press: 1.00000 atm
elementType: 8 8 7 7 7 6 6 6 6 6 6 6 6 6 6 1 1 1 1 1 1 1 1 1 1 1 1 1
symmnumber: 1
zpe: 590209.5 jmol-1
zpe.correction: 0.224799 hartree
zpe.thermalcorrener: 0.237771 hartree
zpe.thermalcorrenthalpy: 0.238716 hartree
zpe.thermalcorrgfe: 0.183843 hartree
zpe.sumelectzpe: -702.367856 hartree
zpe.sumelectthermal: -702.354883 hartree
zpe.sumelectthermalent: -702.353939 hartree
zpe.sumelectthermalfe: -702.408812 hartree
dipole: -9.1604 2.0241 -0.6405
dipole: 9.4032
quadrupole: -110.0588 -85.3320 -88.1060
quadrupole: 0.2295 -1.7025 -0.5473
quadrupole: -15.5599 9.1670 6.3929 0.2295 -1.7025 -0.5473
hfenergy: -702.5926547 hartree
pointgroup: C01 [X(C10H13N3O2)]
dipole: -3.5654942 0.7221317 -0.6723829 debye
polarizability: 263.8321577|2.4212929|130.0955893|25.4995427|-10.6693911|82.7331339 unknown
InChI: InChI=1S/C10H13N3O2/c14-13(15)9-4-5-10(11-8-9)12-6-2-1-3-7-12/h4-5,8H,1-3,6-7H2
charge 0 multiplicity 1
28 atoms
O  4.451802 1.069356 0.481359
O  4.28412 -1.174982 0.904802
N  -1.745455 -0.035013 -0.547229
N  0.226512 -1.147721 0.072267
N  3.769016 -0.032712 0.566066
C  -4.546768 -0.035333 0.315396
C  -3.736332 1.275351 0.181406
C  -3.606671 -1.23008 0.603067
C  -2.607544 1.122742 -0.868954
C  -2.48439 -1.320028 -0.45591
C  -0.390338 0.03962 -0.290844
C  0.367724 1.262502 -0.392648
C  1.734885 1.243942 -0.112678
C  1.548866 -1.148952 0.337796
C  2.345366 0.019195 0.264211
H  -5.304745 0.063672 1.114393
H  -5.098796 -0.222335 -0.62919
H  -4.394144 2.112996 -0.119396
H  -3.286351 1.540768 1.157674
H  -3.14834 -1.117868 1.604576
H  -4.174565 -2.179562 0.605725
H  -3.058894 0.952748 -1.869231
H  -2.013807 2.045957 -0.92964
H  -1.756734 -2.10746 -0.214046
H  -2.927225 -1.53415 -1.4517
H  -0.099208 2.20277 -0.691378
H  2.346639 2.147542 -0.179284
H  2.002876 -2.103166 0.62189
