program: Gaussian 09
title: 000097002
version: EM64L-G09RevD.01
frameworkgroup: C1[X(C12H15N3O6)]
method: RPBEPBE
basis: SDD
operation: Freq
keyword: #p
keyword: freq=noraman
keyword: PBEPBE/SDD
title: #p freq=noraman PBEPBE/SDD
converged: YES YES NO NO
title: Mulliken charges:
elementType: O O O O O O N N N C C C C C C C C C C C C H H H H H H H H H H H H H H H
charge: -0.414983 -0.192975 -0.186082 -0.259845 -0.212133 -0.204868 -0.399657 0.025424 0.016723 -0.476612 -0.138065 -0.340674 -0.351648 0.359577 0.142959 -0.692806 0.237332 -0.274860 -0.502571 -0.420954 0.447436 0.236057 0.229663 0.266187 0.211645 0.194892 0.204072 0.197365 0.363524 0.210895 0.222645 0.217011 0.265233 0.336707 0.292916 0.390470
chargesum: 0.00000
title: Mulliken charges with hydrogens summed into heavy atoms:
elementType: O O O O O O N N N C C C C C C C C C C C C
charge: -0.024513 -0.192975 -0.186082 -0.259845 -0.212133 -0.204868 -0.036133 0.025424 0.016723 -0.010892 0.128122 0.065862 0.049789 0.359577 0.142959 -0.042255 0.237332 -0.009627 -0.165864 -0.128038 0.447436
polarizability: 2.75219701e+02 -1.32030651e+00 1.95304203e+02 -1.58704071e+01 -2.74974909e+01 1.22368739e+02
1716.lowfreq: -2.4713 0.0007 0.0008 0.0010 3.3423 5.9835 17.6860 24.6771 31.4304
frequency: 17.5267 24.6106 31.4220 52.1900 57.9589 58.3701 74.9096 81.8441 96.2334 115.6484 142.9604 165.9667 169.8418 194.0951 221.1441 231.8309 259.8286 276.2459 321.3952 339.3671 343.4843 382.2320 405.0703 436.9620 440.6549 500.1226 508.1094 519.8770 590.8895 605.5093 627.0168 652.9992 658.8412 674.7212 701.4272 706.9606 727.8547 733.9157 754.5287 772.3234 783.3283 817.9297 833.2054 849.9379 885.5436 913.7636 921.2890 967.8638 991.5355 997.1809 1025.6003 1038.6957 1052.2179 1074.0862 1091.4191 1103.8515 1114.2035 1138.7730 1166.1024 1178.3708 1211.9490 1218.2097 1232.6306 1252.8409 1265.2262 1278.4187 1293.3409 1306.7824 1313.8679 1336.4222 1345.1506 1347.3956 1358.6083 1363.8548 1383.6015 1393.3688 1452.4472 1461.8654 1469.1724 1478.2994 1478.5631 1488.8292 1490.1846 1528.0250 1585.4705 1629.7040 1674.7101 2965.8931 2973.1384 2976.9125 2987.3011 3005.7163 3008.1378 3033.2320 3062.7268 3073.8715 3078.2956 3165.5093 3186.9345 3188.7894 3318.0618 3514.7322
redmass: 7.3362 9.5511 5.1950 5.6270 1.7262 7.7973 9.1786 6.8301 4.9208 4.2107 2.9105 5.3221 5.9871 3.8776 3.1168 1.3129 5.8050 5.2331 8.6539 6.6313 6.8052 8.8778 3.1338 4.9822 4.1115 4.8291 5.9086 3.5855 2.7552 1.6999 6.1503 6.8055 5.2951 7.4044 4.3411 7.5767 3.0760 1.0953 9.7070 1.6152 1.3656 2.4100 1.6164 3.3030 5.1156 2.0273 1.5151 1.4124 2.1143 1.5155 3.2281 2.2375 2.2000 2.4664 2.6131 3.0083 2.5947 1.7330 3.2015 2.9524 1.8958 2.7815 1.3926 1.6653 1.4045 1.2704 1.1122 1.2989 2.3306 1.4566 1.6872 3.0484 1.5471 5.0693 4.8360 1.2120 4.1903 1.1620 1.0706 1.0702 1.0429 1.0881 2.5613 3.7472 4.1254 7.1838 9.0709 1.0593 1.0608 1.0363 1.0641 1.0810 1.0983 1.1020 1.1023 1.1010 1.0994 1.0885 1.0954 1.0932 1.0791 1.0643
irintensity: 0.4381 0.7185 0.6308 0.4957 0.0186 0.0696 0.7818 0.2911 1.4614 0.8831 0.3382 2.8461 4.2884 0.4877 0.2914 0.1854 0.8889 1.6066 0.2357 0.3926 0.8790 0.2393 3.7249 5.0032 0.9144 35.5417 5.9216 23.2673 53.4838 76.5795 9.5591 20.8467 38.8998 13.4622 16.2050 11.7735 1.9701 11.1826 12.3755 59.4449 41.4548 0.5178 18.0216 7.8065 8.9752 6.0049 7.5796 23.7835 3.7764 1.5294 256.7959 64.4551 16.3766 0.6526 5.9742 65.8288 5.1992 16.9748 216.6795 261.0600 156.0331 195.2893 36.5584 31.8493 7.3316 2.6849 4.4355 11.7817 125.1903 8.5827 31.4706 147.6108 5.2146 55.8028 53.5652 11.3177 6.0878 1.3272 1.4902 3.3326 13.2298 18.2332 36.5996 120.4545 141.1900 402.0262 191.5923 1.8708 41.6566 34.9621 36.0277 14.4226 1.8573 13.3779 22.0767 82.7723 52.0985 3.7588 3.2093 21.5232 94.6511 38.5415
temp: 298.150 k
press: 1.00000 atm
elementType: 8 8 8 8 8 8 7 7 7 6 6 6 6 6 6 6 6 6 6 6 6 1 1 1 1 1 1 1 1 1 1 1 1 1 1 1
symmnumber: 1
zpe: 710581.7 jmol-1
zpe.correction: 0.270646 hartree
zpe.thermalcorrener: 0.291506 hartree
zpe.thermalcorrenthalpy: 0.292450 hartree
zpe.thermalcorrgfe: 0.217443 hartree
zpe.sumelectzpe: -1080.156793 hartree
zpe.sumelectthermal: -1080.135934 hartree
zpe.sumelectthermalent: -1080.134990 hartree
zpe.sumelectthermalfe: -1080.209996 hartree
dipole: -7.9829 4.3289 -2.0521
dipole: 9.3101
quadrupole: -145.8380 -123.7727 -130.2670
quadrupole: -2.0193 5.1970 5.4551
quadrupole: -12.5454 9.5199 3.0256 -2.0193 5.1970 5.4551
hfenergy: -1080.4274396 hartree
pointgroup: C01 [X(C12H15N3O6)]
dipole: -3.1361418 1.6487375 -0.9288976 debye
polarizability: 276.1411625|0.8328675|194.9388205|-10.0131325|-28.176686|121.8126598 unknown
InChI: InChI=1S/C12H15N3O6/c1-2-3-4-10(12(16)17)13-9-6-5-8(14(18)19)7-11(9)15(20)21/h5-7,10,13,16H,2-4H2,1H3
charge 0 multiplicity 1
36 atoms
O  -2.271948 3.461389 0.18055
O  -1.383224 2.308832 1.999564
O  1.534823 -3.157891 1.373529
O  -0.584177 -2.337226 1.270585
O  5.073211 1.342892 -1.172954
O  5.32857 -0.733704 -0.252164
N  -1.019274 0.033181 0.246989
N  0.70688 -2.225538 1.055897
N  4.603739 0.272336 -0.615989
C  -3.421894 0.554946 -0.005068
C  -1.964695 1.092003 -0.101851
C  -3.730857 -0.562603 -1.027355
C  -5.195985 -1.047091 -0.930175
C  0.333038 0.088281 0.050002
C  -1.811833 2.308807 0.831075
C  -5.518003 -2.167662 -1.941641
C  1.212404 -1.001018 0.429977
C  0.955342 1.232948 -0.560914
C  2.604317 -0.936324 0.213972
C  2.328442 1.294678 -0.778437
C  3.151027 0.203217 -0.387185
H  -4.107174 1.405974 -0.173949
H  -3.602919 0.190824 1.026279
H  -1.793155 1.441674 -1.138232
H  -3.053975 -1.426189 -0.872977
H  -3.535027 -0.188189 -2.05324
H  -5.393172 -1.40985 0.098886
H  -5.87806 -0.188521 -1.095885
H  -1.351597 -0.81886 0.729847
H  -5.356424 -1.825308 -2.981055
H  -6.569342 -2.496147 -1.854472
H  -4.873811 -3.050852 -1.774052
H  0.335494 2.082721 -0.857739
H  3.241758 -1.772007 0.513732
H  2.79391 2.168613 -1.24175
H  -2.231907 4.240066 0.799798
