program: Gaussian 09
title: 000096533
version: EM64L-G09RevD.01
frameworkgroup: C1[X(C14H10O4)]
method: RPBEPBE
basis: SDD
operation: Freq
keyword: #pfreq=noraman
keyword: PBEPBE/SDD
title: #p freq=noraman PBEPBE/SDD
converged: YES YES NO NO
title: Mulliken charges:
elementType: O O O O C C C C C C C C C C C C C C H H H H H H H H H H
charge: -0.440014 -0.440013 -0.245125 -0.245125 0.361108 0.361108 -0.505066 -0.505066 -0.387673 -0.387673 0.245862 0.245861 -0.220892 -0.220893 -0.335281 -0.335281 0.099628 0.099628 0.284691 0.284691 0.243795 0.243795 0.233851 0.233851 0.279377 0.279376 0.385741 0.385741
chargesum: 0.00000
title: Mulliken charges with hydrogens summed into heavy atoms:
elementType: O O O O C C C C C C C C C C C C C C
charge: -0.054273 -0.054272 -0.245125 -0.245125 0.361108 0.361108 -0.220376 -0.220375 -0.143878 -0.143878 0.245862 0.245861 0.012958 0.012958 -0.055905 -0.055904 0.099628 0.099628
polarizability: 2.54170680e+02 4.99441032e-05 1.85988308e+02 1.17391212e+01 -3.16029993e-05 7.56546905e+01
1716.lowfreq: -5.6344 -1.7768 -0.0010 -0.0010 -0.0009 2.5752 33.3827 48.4733 55.0894
frequency: 33.3815 48.4699 55.0888 71.6719 93.9847 156.5413 165.8116 169.5271 210.2701 256.4658 279.3948 324.6175 381.9879 399.1109 420.8837 423.8803 465.8637 499.2946 528.7039 546.3786 591.1171 597.6013 603.9381 617.0833 622.8503 690.4057 694.6320 702.4165 725.8858 737.5331 760.0280 818.7900 827.9436 851.8882 930.5675 943.6619 951.7846 956.1856 986.4432 991.1679 998.9974 999.9895 1009.7304 1041.4468 1069.5604 1097.4642 1097.8548 1143.2958 1150.2416 1185.6765 1190.9269 1268.8433 1296.1442 1300.6880 1321.8758 1330.1942 1380.0935 1383.9741 1428.0503 1433.8630 1470.8070 1488.4494 1581.9190 1589.5561 1613.7162 1615.9761 1643.4237 1647.3990 3131.4940 3135.0231 3149.9989 3154.0085 3154.2111 3156.7546 3182.8452 3182.9351 3528.9772 3529.0589
redmass: 6.8715 8.5190 9.2696 7.4947 5.4168 5.5840 4.7604 5.7269 4.7979 6.7337 4.7997 5.8762 7.3850 5.2072 3.3665 3.1033 4.8877 6.8181 4.0620 2.2380 4.7644 4.6086 1.3054 7.1962 1.6092 5.6503 3.1150 1.9384 2.5038 5.6632 6.7079 1.6693 1.6036 5.6045 1.3771 1.4489 1.4533 1.5841 6.1031 4.2860 1.3596 1.4780 5.1007 2.9371 1.8946 1.6043 1.7715 1.5913 1.7036 1.1148 1.1090 2.0056 1.4512 1.5149 2.1869 2.3875 5.3316 10.7436 4.5377 2.8392 2.5594 2.9920 5.5800 6.6864 6.1133 6.4319 8.7219 8.6615 1.0877 1.0871 1.0922 1.0920 1.0940 1.0936 1.0965 1.0965 1.0641 1.0642
irintensity: 0.0389 3.0088 0.3957 0.0569 0.3720 0.7887 0.0621 0.7704 0.8037 0.4799 0.6815 10.4221 3.1295 4.2072 11.6132 0.8127 8.2858 0.9406 22.9704 4.5267 102.9908 21.9142 233.7754 12.4758 26.1760 2.9632 1.8908 3.5061 159.0758 7.1480 4.8955 44.2509 5.1232 1.5425 3.3066 0.0007 21.7083 1.2108 1.1731 0.4892 1.3081 0.2256 481.6590 30.0102 88.4375 12.1708 20.1194 36.4988 230.0316 2.9157 0.1513 12.5890 61.1269 9.8645 126.4557 42.0045 0.1646 4.6768 0.2889 77.7355 0.4923 7.2453 18.7706 25.5351 47.8077 3.1877 55.8652 352.9624 15.6046 0.2243 6.7877 5.2923 3.4009 20.7189 2.0089 6.8874 70.3758 28.9515
temp: 298.150 k
press: 1.00000 atm
elementType: 8 8 8 8 6 6 6 6 6 6 6 6 6 6 6 6 6 6 1 1 1 1 1 1 1 1 1 1
symmnumber: 1
zpe: 539627.8 jmol-1
zpe.correction: 0.205533 hartree
zpe.thermalcorrener: 0.220531 hartree
zpe.thermalcorrenthalpy: 0.221475 hartree
zpe.thermalcorrgfe: 0.161864 hartree
zpe.sumelectzpe: -839.172579 hartree
zpe.sumelectthermal: -839.157581 hartree
zpe.sumelectthermalent: -839.156637 hartree
zpe.sumelectthermalfe: -839.216249 hartree
dipole: 0.0000 3.7608 0.0000
dipole: 3.7608
quadrupole: -79.5107 -99.2776 -106.9414
quadrupole: 0.0000 3.1928 0.0000
quadrupole: 15.7325 -4.0344 -11.6982 0.0000 3.1928 0.0000
hfenergy: -839.3781128 hartree
pointgroup: C01 [X(C14H10O4)]
dipole: 0.0000052 -1.4796248 -0.0000164 debye
polarizability: 254.2523638|0.0000742|185.9883085|-11.1003809|0.0012354|75.5730068 unknown
InChI: InChI=1S/C14H10O4/c15-13(16)11-5-1-3-9(7-11)10-4-2-6-12(8-10)14(17)18/h1-8,15,17H
charge 0 multiplicity 1
28 atoms
O  -5.036232 1.374491 -0.115153
O  5.036226 1.374484 0.115183
O  -3.143513 2.575053 -0.719604
O  3.143508 2.575037 0.719653
C  -0.741248 -0.915052 0.084806
C  0.74124 -0.915049 -0.084836
C  -1.506301 0.248144 -0.17859
C  1.506293 0.248142 0.178585
C  -1.426984 -2.084743 0.518718
C  1.426976 -2.08473 -0.518773
C  -2.913011 0.244096 -0.015795
C  2.913002 0.244096 0.015789
C  -2.828947 -2.091463 0.679745
C  2.828939 -2.091448 -0.679802
C  -3.582618 -0.929727 0.414451
C  3.582609 -0.929718 -0.414482
C  -3.652035 1.499663 -0.320917
C  3.652029 1.499657 0.320937
H  -1.030912 1.168005 -0.535916
H  1.030905 1.167996 0.535929
H  -0.854363 -2.987174 0.760761
H  0.854357 -2.987157 -0.760836
H  -3.331057 -3.002011 1.023156
H  3.331047 -3.00199 -1.023231
H  -4.668925 -0.915302 0.534972
H  4.668916 -0.915292 -0.535005
H  -5.469017 2.243203 -0.33337
H  5.469013 2.24319 0.333424
