program: Gaussian 09
title: 000096454
version: EM64L-G09RevD.01
frameworkgroup: C1[X(C5H8S4)]
method: RPBEPBE
basis: SDD
operation: Freq
keyword: #p
keyword: freq=noraman
keyword: PBEPBE/SDD
title: #p freq=noraman PBEPBE/SDD
converged: YES YES NO NO
title: Mulliken charges:
elementType: S S S S C C C C C H H H H H H H H
charge: 0.065193 0.075084 0.065194 0.075082 0.231545 -0.719184 -0.671878 -0.719187 -0.671871 0.277179 0.276823 0.312114 0.268897 0.277180 0.276823 0.312111 0.268896
chargesum: 0.00000
title: Mulliken charges with hydrogens summed into heavy atoms:
elementType: S S S S C C C C C
charge: 0.065193 0.075084 0.065194 0.075082 0.231545 -0.165182 -0.090867 -0.165185 -0.090865
polarizability: 1.37009348e+02 8.60061930e-05 1.13063243e+02 1.60745027e+01 2.42080812e-05 9.11403162e+01
1716.lowfreq: -9.6343 -0.0027 0.0027 0.0027 7.9109 13.7648 51.8249 64.4170 107.0207
frequency: 51.8021 64.2311 107.0207 179.2815 210.0026 287.1393 323.0903 336.5030 384.9591 402.4909 405.1977 438.4045 536.5496 646.6854 683.4990 719.0407 725.8278 771.2676 843.5362 869.0917 884.9820 908.2057 1009.7763 1050.6828 1057.8166 1113.9628 1133.7596 1193.1779 1225.0416 1241.3890 1256.9661 1291.7833 1298.9728 1420.6330 1421.2049 1437.8278 1448.3981 3015.7010 3020.6878 3023.3861 3026.3683 3091.7577 3096.5326 3105.3723 3105.5714
redmass: 13.6767 6.7636 9.0480 3.0353 2.6726 5.1623 6.6326 3.2231 3.0620 15.7483 8.7985 4.4277 4.5195 7.0858 5.2039 5.0282 5.3784 4.1503 1.4839 1.5472 2.0086 1.7129 1.5982 1.9334 1.8345 1.0475 1.2804 1.3875 1.1419 1.1521 1.5242 1.4167 1.7833 1.0806 1.0820 1.0915 1.0936 1.0558 1.0557 1.0560 1.0565 1.1095 1.1089 1.1090 1.1077
irintensity: 0.1688 1.2337 2.0854 7.9808 0.0006 1.0130 0.3386 0.0698 1.2367 0.4861 0.3614 0.3625 0.7763 1.8247 2.6381 4.3570 0.7209 0.0445 2.3062 0.4758 16.9755 4.4831 3.1955 7.7060 6.6008 1.2976 0.0493 0.1603 13.3029 13.6710 11.5385 10.5818 21.3579 20.5897 5.4914 8.6779 9.2824 1.1976 13.5271 15.1131 20.2080 4.6830 4.7249 1.8147 17.2836
temp: 298.150 k
press: 1.00000 atm
elementType: 16 16 16 16 6 6 6 6 6 1 1 1 1 1 1 1 1
symmnumber: 1
zpe: 322187.7 jmol-1
zpe.correction: 0.122715 hartree
zpe.thermalcorrener: 0.132694 hartree
zpe.thermalcorrenthalpy: 0.133638 hartree
zpe.thermalcorrgfe: 0.085892 hartree
zpe.sumelectzpe: -1786.858786 hartree
zpe.sumelectthermal: -1786.848806 hartree
zpe.sumelectthermalent: -1786.847862 hartree
zpe.sumelectthermalfe: -1786.895608 hartree
dipole: 0.0000 3.0280 0.0000
dipole: 3.0280
quadrupole: -100.0288 -80.3160 -82.5956
quadrupole: 0.0000 1.8485 0.0000
quadrupole: -12.3820 7.3308 5.0512 0.0000 1.8485 0.0000
hfenergy: -1786.9815004 hartree
pointgroup: C01 [X(C5H8S4)]
dipole: 0.000001 1.191314 -0.0003628 debye
dipolederiv: -0.1331137 0.0147752 0.0319262 0.0139269 -0.1514041 0.0169273 0.0623398 0.0374578 -0.035194 -0.1415276 0.0380473 0.0085354 -0.0171548 0.0231978 0.0512652 -0.0010933 0.0278186 -0.1237103 -0.1331246 -0.0147505 0.0319354 -0.0138952 -0.1514393 -0.0168539 0.0623499 -0.0373763 -0.0351554 -0.1415197 -0.0380373 0.0085498 0.0171588 0.0231569 -0.0513709 -0.0011075 -0.0279126 -0.1236661 -0.0051405 -0.0000166 -0.0543648 -0.0000664 -0.0761274 0.0000269 -0.2706528 0.0000253 0.0178994 0.0790836 -0.1164279 0.0080983 -0.0861937 0.1573636 -0.0584425 0.0579822 -0.106 0.0485316 0.0817734 -0.0964577 0.0323621 -0.1480051 -0.0138916 -0.1560692 0.0677659 -0.1072456 0.0391374 0.0790964 0.1164272 0.0080357 0.0862255 0.1574571 0.0583841 0.0579357 0.1059385 0.04843 0.0817625 0.0964706 0.032316 0.1480439 -0.0137417 0.1561046 0.0676909 0.1072808 0.0389887 -0.0169525 0.0518041 -0.0189524 -0.0052913 -0.045263 0.0600733 -0.0015073 0.1314161 -0.0099038 0.0617432 0.0872021 0.0550445 0.0616659 0.0300982 -0.0597078 0.0098719 -0.0571491 -0.0070629 0.0697652 -0.049024 -0.0761235 0.0250341 0.057214 0.009056 -0.0766894 0.0073789 0.1111504 0.0017962 0.0340334 -0.0136969 0.0437877 -0.0192507 0.1440271 0.0166905 0.0595547 -0.031899 -0.0169504 -0.0518118 -0.0189215 0.005293 -0.0453716 -0.0600523 -0.0015083 -0.1313986 -0.0097947 0.0617474 -0.0871696 0.0550928 -0.0616586 0.030165 0.0596884 0.0099061 0.057127 -0.0071261 0.0697681 0.0489812 -0.0761548 -0.0250889 0.0572027 -0.0090236 -0.0766853 -0.007353 0.1111617 0.0017931 -0.0340456 -0.0136823 -0.0437816 -0.0193658 -0.1440326 0.0167109 -0.0595625 -0.0317868 unknown
polarizability: 135.042389|0.0058496|113.0632409|18.567261|-0.005846|93.1072769 unknown
InChI: InChI=1S/C5H8S4/c1-5(2-7-6-1)3-8-9-4-5/h1-4H2
charge 0 multiplicity 1
17 atoms
S  2.737911 0.255647 0.755199
S  2.044602 -1.432549 -0.703939
S  -2.737954 0.255144 -0.755344
S  -2.044647 -1.432135 0.704845
C  -0.000029 0.382666 -0.000093
C  1.184029 1.290479 0.436054
C  0.488506 -0.482601 -1.189353
C  -1.184104 1.290198 -0.436776
C  -0.488533 -0.481919 1.189673
H  1.413973 2.030228 -0.348733
H  0.964623 1.808483 1.385919
H  -0.262497 -1.244459 -1.45881
H  0.719241 0.153709 -2.059601
H  -1.414075 2.030383 0.34759
H  -0.964702 1.807667 -1.386933
H  0.262486 -1.243622 1.459527
H  -0.719229 0.15488 2.059574
