program: Gaussian 09
title: 000096995
version: EM64L-G09RevD.01
frameworkgroup: C1[X(C12H15ClN4O3)]
method: RPBEPBE
basis: SDD
operation: Freq
keyword: #p
keyword: freq=noraman
keyword: PBEPBE/SDD
title: #p freq=noraman PBEPBE/SDD
converged: YES YES NO NO
title: Mulliken charges:
elementType: Cl O O O N N N N C C C C C C C C C C C C H H H H H H H H H H H H H H H
charge: -0.036891 -0.286405 -0.250211 -0.225648 -0.137740 -0.472233 -0.191945 0.039889 0.269307 0.493283 -0.355825 -0.311614 -0.450562 -0.366042 0.146187 -0.333112 0.308898 -0.613444 -0.632387 -0.569825 0.270136 0.249242 0.233203 0.298852 0.351655 0.272657 0.276360 0.281158 0.221699 0.224477 0.232752 0.227837 0.262807 0.294076 0.279408
chargesum: 0.00000
title: Mulliken charges with hydrogens summed into heavy atoms:
elementType: Cl O O O N N N N C C C C C C C C C C C C
charge: -0.036891 -0.286405 -0.250211 -0.225648 -0.137740 -0.120578 -0.191945 0.039889 0.269307 0.493283 -0.085689 -0.062373 -0.217359 -0.067191 0.146187 0.215905 0.308898 0.113891 0.091009 0.003660
polarizability: 3.24925489e+02 9.79074425e+00 1.82274037e+02 1.01084917e+01 -8.71454299e+00 1.01411706e+02
1716.lowfreq: -9.8902 -5.2286 -1.6095 -0.0006 0.0005 0.0019 15.0016 23.5767 29.1233
frequency: 14.0503 23.3790 29.1128 54.8694 59.6033 68.7122 70.6000 98.3293 114.2934 122.3123 132.1901 151.9971 178.0657 193.0430 224.6590 226.6430 256.3614 280.0195 317.6777 330.4264 341.9234 366.2457 382.8325 407.5607 418.2586 459.5993 479.2624 485.3347 548.1319 612.1575 630.9647 680.6443 684.3417 695.3464 702.5051 739.9528 758.5167 787.7075 791.7157 828.9242 848.0243 851.0706 869.7179 909.3225 921.2752 967.9923 989.9842 1008.6356 1040.5266 1051.5434 1052.5315 1065.4475 1092.9445 1095.3320 1128.5333 1141.4804 1191.7470 1208.2775 1217.2658 1237.6178 1242.9974 1265.5753 1268.3676 1311.5340 1323.9137 1357.4539 1370.5018 1379.7174 1381.5099 1411.8996 1417.0442 1437.3664 1440.9811 1455.4709 1468.2230 1471.6522 1488.1049 1496.8637 1504.0275 1523.5908 1559.3331 1591.6142 1620.8944 1657.3662 2959.9482 2968.4862 3029.2244 3043.8201 3046.5314 3069.7993 3120.4870 3121.2830 3122.3568 3123.7936 3146.5312 3159.4208 3166.1291 3193.9769 3436.1983
redmass: 5.2220 7.2464 6.9688 3.2180 5.4510 4.2159 4.0796 3.9896 5.8005 1.5535 3.3445 1.7284 3.4894 4.3547 4.4976 4.4201 5.0215 3.6862 5.0901 2.9099 4.4183 6.2999 3.3424 4.6161 3.2477 9.0307 5.1513 7.3792 3.0850 6.4702 6.9126 4.5316 6.9447 5.8111 6.5081 1.9751 3.2723 1.3657 2.2851 5.0729 1.3386 4.7387 1.6179 4.0971 2.8982 1.4039 1.3298 3.1099 2.2652 1.4126 2.3787 2.2157 3.0910 1.2311 1.3779 1.3877 1.1804 1.8710 2.8535 2.4543 4.3111 1.3652 2.0823 1.3472 1.2221 1.3276 5.4402 5.1726 3.2596 1.2058 3.5217 1.1234 1.2066 1.0924 1.0666 1.0568 1.0491 1.4721 1.8953 2.4602 4.7396 4.7861 5.9427 9.1789 1.0377 1.0374 1.1009 1.1002 1.0593 1.0558 1.0959 1.1047 1.0973 1.0902 1.0903 1.1129 1.0951 1.0946 1.0764
irintensity: 0.1100 1.3207 1.2045 2.4562 2.2507 1.9535 1.4314 2.7308 5.9221 1.8880 5.4220 1.1264 4.1546 6.4992 1.6451 1.7416 2.4579 5.4750 17.8306 1.0481 9.5142 23.5829 17.7310 5.1397 3.4395 2.4645 19.8420 2.6806 17.7692 2.5726 0.3658 11.0319 15.3938 28.8130 54.5631 5.3162 1.6388 54.5296 142.0084 4.5549 41.1147 42.7495 68.3875 8.2997 167.6912 2.2729 2.4315 11.7241 91.0282 19.9886 14.6183 140.0144 12.1997 0.2527 13.1807 2.8931 37.1483 5.0265 32.2131 46.0005 101.3375 7.2773 3.1127 14.2859 28.6346 6.7217 223.0429 193.8494 65.7588 58.5812 32.9785 29.2695 26.3396 10.1116 9.8141 23.1124 18.6552 9.7141 219.5610 397.2531 257.6911 105.9531 62.9270 229.0326 41.6622 117.9432 42.4086 31.6851 1.7076 12.6474 17.5384 1.2816 1.6956 11.4990 8.7719 2.6127 2.2964 2.3999 70.1527
temp: 298.150 k
press: 1.00000 atm
elementType: 17 8 8 8 7 7 7 7 6 6 6 6 6 6 6 6 6 6 6 6 1 1 1 1 1 1 1 1 1 1 1 1 1 1 1
symmnumber: 1
zpe: 698568.5 jmol-1
zpe.correction: 0.266071 hartree
zpe.thermalcorrener: 0.286783 hartree
zpe.thermalcorrenthalpy: 0.287727 hartree
zpe.thermalcorrgfe: 0.212717 hartree
zpe.sumelectzpe: -1369.490876 hartree
zpe.sumelectthermal: -1369.470164 hartree
zpe.sumelectthermalent: -1369.469220 hartree
zpe.sumelectthermalfe: -1369.544230 hartree
dipole: -2.1675 -1.4253 2.6449
dipole: 3.7047
quadrupole: -137.7595 -127.5663 -126.0471
quadrupole: 16.7513 -15.2421 0.6922
quadrupole: -7.3019 2.8913 4.4106 16.7513 -15.2421 0.6922
hfenergy: -1369.7569471 hartree
pointgroup: C01[X(C12H15Cl1N4O3)]
dipole: -0.8391684 0.0094525 -1.1917016 debye
polarizability: 325.9928035|-0.5726285|160.3292419|0.4555996|-36.7437688|122.2891863 unknown
InChI: InChI=1S/C12H15ClN4O3/c1-16(2)11(18)9-3-5-10(6-4-9)14-12(19)17(15-20)8-7-13/h3-6,14H,7-8H2,1-2H3
charge 0 multiplicity 1
35 atoms
Cl 6.753825 2.278302 -0.212009
O  -4.949833 -0.674351 1.491658
O  2.128087 1.199084 -0.839012
O  4.972223 -2.095379 0.667096
N  -5.18003 0.301198 -0.613279
N  1.323458 -0.792204 0.164797
N  3.643837 -0.446078 -0.127635
N  3.774224 -1.692341 0.505135
C  -2.921371 -0.374637 0.227945
C  -0.085689 -0.600666 0.163243
C  -2.276539 -1.52339 0.755615
C  -2.118611 0.666483 -0.303207
C  -0.878542 -1.645563 0.712277
C  -0.712952 0.569296 -0.33817
C  -4.415735 -0.267324 0.406479
C  4.802621 0.339989 -0.607898
C  2.288533 0.069679 -0.304256
C  -6.610551 0.550441 -0.361039
C  -4.743207 0.484564 -2.00756
C  5.265174 1.343874 0.461785
H  -2.889587 -2.304463 1.215568
H  -2.588849 1.5859 -0.668163
H  -0.396236 -2.544858 1.114953
H  -0.105681 1.382717 -0.738974
H  1.686602 -1.666143 0.568041
H  5.611786 -0.37385 -0.836899
H  4.49416 0.875114 -1.51882
H  -6.804896 0.421481 0.713967
H  -6.876102 1.578088 -0.672541
H  -7.243852 -0.164394 -0.922894
H  -5.476415 0.007407 -2.686766
H  -4.676438 1.556824 -2.278505
H  -3.763597 0.015102 -2.176366
H  4.498583 2.103035 0.670747
H  5.608399 0.849763 1.381886
