program: Gaussian 09
title: 000095940
version: EM64L-G09RevD.01
frameworkgroup: C1[X(C8H11NO2)]
method: RPBEPBE
basis: SDD
operation: Freq
keyword: #p
keyword: freq=noraman
keyword: PBEPBE/SDD
title: #p freq=noraman PBEPBE/SDD
converged: NO YES YES YES
title: Mulliken charges:
elementType: O O N C C C C C C C C H H H H H H H H H H H
charge: -0.308343 -0.308344 -0.680165 0.137061 0.251649 0.251646 -0.354831 -0.354831 -0.263424 -0.531090 -0.531090 0.232303 0.232303 0.216489 0.327642 0.327643 0.220386 0.220386 0.236919 0.220380 0.220392 0.236919
chargesum: 0.00000
title: Mulliken charges with hydrogens summed into heavy atoms:
elementType: O O N C C C C C C C C
charge: -0.308343 -0.308344 -0.024881 0.137061 0.251649 0.251646 -0.122528 -0.122528 -0.046934 0.146600 0.146601
polarizability: 1.40335436e+02 3.28287118e-05 1.16150068e+02 -1.26147977e-03 -6.02949970e-03 5.25639212e+01
1716.lowfreq: -6.2006 -3.4213 -0.0008 -0.0006 0.0006 5.4761 59.3547 94.6938 154.0045
frequency: 59.3449 94.6936 154.0042 183.9147 199.6149 236.3475 239.8641 286.4882 302.9644 328.8747 351.2811 390.2292 487.7127 493.0445 514.4240 546.7825 561.4065 576.3273 673.9838 708.2937 750.2587 827.8894 828.7365 834.0739 907.9443 1002.1769 1023.5490 1081.7874 1116.1121 1116.5742 1128.3436 1154.5602 1162.1813 1187.9662 1230.4963 1257.7023 1312.4479 1422.5558 1435.2047 1440.1325 1464.0777 1464.1707 1467.4407 1477.3711 1477.4849 1520.6795 1578.0197 1610.1114 1623.7326 2954.3598 2954.8439 3039.0158 3039.1039 3118.6745 3118.7902 3139.6459 3159.4347 3173.4504 3573.0379 3725.8374
redmass: 2.9925 3.5497 5.0239 3.4109 1.4632 3.1516 1.1581 1.8913 2.9899 3.1967 4.5463 1.3379 5.7707 1.0132 6.4637 3.9001 5.5385 3.4822 6.0927 1.5544 3.2676 5.1193 1.3775 4.1808 1.2709 9.4157 2.5119 1.8794 1.2593 1.2594 1.9874 1.3913 1.3685 1.4248 7.4471 1.5844 2.5420 4.2292 1.3749 1.1650 1.0499 1.0501 2.4261 1.0706 1.0612 3.5669 1.4468 7.2045 3.7472 1.0330 1.0331 1.1036 1.1036 1.0992 1.0991 1.0854 1.0907 1.0981 1.0432 1.1055
irintensity: 10.2034 0.0000 4.3384 2.7862 0.0000 9.6398 1.2274 0.0000 30.1585 0.0004 0.0908 291.5451 6.4399 0.0001 0.1725 0.1486 0.0000 23.3840 5.4137 65.0755 35.6280 2.4613 0.0000 2.7704 1.3455 15.0915 44.0781 21.7832 0.3827 0.0000 353.0707 10.9349 0.4737 129.3639 8.9224 6.6280 27.5332 8.0965 5.1824 8.4625 0.0001 25.2004 92.1160 16.7104 33.0432 121.7370 60.5832 84.8183 183.7937 132.5832 16.5142 0.0019 106.9402 25.7875 28.9772 2.8108 20.3835 14.5690 83.5659 47.6478
temp: 298.150 k
press: 1.00000 atm
elementType: 8 8 7 6 6 6 6 6 6 6 6 1 1 1 1 1 1 1 1 1 1 1
symmnumber: 1
zpe: 468275.6 jmol-1
zpe.correction: 0.178357 hartree
zpe.thermalcorrener: 0.189596 hartree
zpe.thermalcorrenthalpy: 0.190540 hartree
zpe.thermalcorrgfe: 0.141971 hartree
zpe.sumelectzpe: -515.789272 hartree
zpe.sumelectthermal: -515.778034 hartree
zpe.sumelectthermalent: -515.777090 hartree
zpe.sumelectthermalfe: -515.825658 hartree
dipole: 0.0000 -0.2077 -0.0011
dipole: 0.2077
quadrupole: -44.6146 -59.8152 -70.2472
quadrupole: 0.0000 0.0026 -0.0052
quadrupole: 13.6111 -1.5895 -12.0215 0.0000 0.0026 -0.0052
hfenergy: -515.9676293 hartree
pointgroup: C01 [X(C8H11N1O2)]
dipole: 0.0000065 0.0816999 0.0004241 debye
dipolederiv: -1.5977551 -0.2105774 0.0000529 -0.4212197 -0.4211961 0.0000268 0.0000372 -0.0000328 -0.2941406 -1.5977695 0.2105588 -0.0000075 0.4212019 -0.4211849 0.000037 -0.0001417 0.000091 -0.2941406 -0.1559546 0.0000158 0.0000549 0.0000141 -1.4604427 -0.0001591 0.0000421 -0.0006028 -0.7144312 -0.5880921 -0.0000215 -0.0000146 -0.0000195 1.4341967 0.0000302 0.0000314 -0.0000115 0.0818079 1.195862 0.5787106 -0.0000405 0.4406321 0.0465536 -0.0000862 -0.0000035 0.0000224 0.0148722 1.1958795 -0.5786913 0.0001422 -0.4406139 0.0465368 -0.000019 0.0002537 -0.000053 0.0148713 -0.1204785 0.0002097 0.000012 -0.0093402 -0.0279911 0.0000047 0.0000102 -0.0000159 -0.1978823 -0.1204768 -0.0002117 0.0000106 0.0093385 -0.0279896 0.0000047 -0.0000433 0.0000233 -0.1978823 -0.0300256 0. 0.0000258 0.0000004 -0.0948911 -0.0000419 0.0000102 -0.0000319 -0.2182467 0.8610324 -0.0144407 -0.0000209 -0.298535 0.2349842 0.0000234 -0.0000082 0.0000143 0.3343708 0.8610313 0.0144511 -0.0000348 0.2985457 0.234988 0.0000215 -0.0001151 0.0000252 0.334371 -0.078314 0.0914318 -0.0000249 0.0902589 0.0645556 0.0000174 -0.0000278 0.0000191 0.1690929 -0.0783115 -0.0914347 -0.0000096 -0.0902617 0.0645517 0.0000108 -0.00002 0.0000041 0.1690932 0.0644897 0.0000032 -0.0000053 0.0000021 -0.1342677 0.0000409 0.0000002 0.0000436 0.171026 0.1866908 0.0394011 0.0000219 -0.0128315 0.2485058 0.0000639 0.0000884 0.0002817 0.3860729 0.1866934 -0.0394027 -0.0000661 0.0128302 0.2485058 0.0000511 -0.0001169 0.0002742 0.3860726 -0.0076099 -0.006718 -0.0097258 0.1567152 0.0021956 -0.1249436 0.0598019 -0.1022431 -0.0966513 -0.0076356 -0.0066797 0.0096768 0.1567397 0.0022429 0.1249013 -0.0598605 0.1022294 -0.0966938 -0.0770048 -0.0901801 0.0000309 -0.153887 -0.022146 0.0000383 0.000042 0.0000353 0.1208814 -0.0076529 0.0066654 0.0096534 -0.1567797 0.002163 -0.1249264 -0.0598263 -0.1022688 -0.0966239 -0.0075895 0.006731 -0.0097523 -0.1566758 0.002272 0.124918 0.059834 0.1022059 -0.096721 -0.0770087 0.0901792 0.0000209 0.1538852 -0.0221425 -0.0000139 0.0000116 -0.0000095 0.1208816 unknown
polarizability: 140.3354359|0.0001496|116.1500682|0.0012615|-0.0060295|52.5639212 unknown
InChI: InChI=1S/C8H11NO2/c1-10-6-4-3-5-7(11-2)8(6)9/h3-5H,9H2,1-2H3
charge 0 multiplicity 1
22 atoms
O  -2.367691 -0.788656 0.000129
O  2.367642 -0.788615 0.000443
N  -0.000009 -2.083009 0.000186
C  -0.000026 -0.695476 0.000177
C  -1.219891 0.039746 0.000049
C  1.219828 0.039768 0.000207
C  -1.227646 1.451482 -0.000115
C  1.227555 1.451506 0.000052
C  -0.000052 2.152988 -0.000135
C  -3.667177 -0.124053 0.000257
C  3.667119 -0.123994 -0.000098
H  -2.171274 2.005015 -0.000236
H  2.171172 2.005057 0.000068
H  -0.000066 3.247599 -0.000283
H  -0.886144 -2.577852 0.000583
H  0.886139 -2.577829 0.000738
H  -3.798266 0.503499 0.90396
H  -3.798546 0.503284 -0.903555
H  -4.41165 -0.934217 0.000461
H  3.798624 0.503631 0.903495
H  3.798056 0.503273 -0.90402
H  4.411604 -0.934146 -0.000162
