program: Gaussian 09
title: 000096236
version: EM64L-G09RevD.01
frameworkgroup: C1[X(C12H22O6)]
method: RPBEPBE
basis: SDD
operation: Freq
keyword: #pfreq=noraman
keyword: PBEPBE/SDD
title: #p freq=noraman PBEPBE/SDD
converged: YES YES NO NO
title: Mulliken charges:
elementType: O O O O O O C C C C C C C C C C C C H H H H H H H H H H H H H H H H H H H H H H
charge: -0.267812 -0.267821 -0.245442 -0.245434 -0.237638 -0.237635 -0.126945 -0.126945 0.216690 0.216675 -0.215767 -0.215767 -0.682334 -0.682333 -0.228169 -0.228168 -0.675086 -0.675088 0.249529 0.249519 0.187138 0.221370 0.187136 0.221374 0.234649 0.224931 0.203768 0.224930 0.234649 0.203768 0.224249 0.242308 0.224248 0.242314 0.226176 0.238879 0.209515 0.226175 0.238880 0.209514
chargesum: 0.00000
title: Mulliken charges with hydrogens summed into heavy atoms:
elementType: O O O O O O C C C C C C C C C C C C
charge: -0.267812 -0.267821 -0.245442 -0.245434 -0.237638 -0.237635 0.122584 0.122574 0.216690 0.216675 0.192740 0.192743 -0.018986 -0.018986 0.238388 0.238393 -0.000515 -0.000519
polarizability: 1.74564226e+02 -1.02438208e+01 1.48924792e+02 7.70124348e-04 2.10827042e-05 1.36491620e+02
1716.lowfreq: -13.7729 -9.0619 -7.2784 -0.0006 0.0003 0.0005 10.0597 14.4791 22.9261
frequency: 7.4480 14.3907 22.9225 36.0177 38.4905 54.9788 56.6009 57.6484 70.4864 100.1585 101.0316 118.7052 127.4077 150.6531 168.4139 179.4725 204.0443 231.4242 233.5483 255.1861 258.1941 275.6933 291.0765 293.8045 304.3378 310.7246 361.2825 373.8941 464.5616 496.4065 521.5865 660.4879 681.6990 711.6776 788.7417 800.1857 800.4502 806.4998 811.8008 817.4435 818.6297 847.2890 850.1210 877.4890 930.6085 1009.4806 1014.6225 1021.3013 1023.3541 1057.7609 1065.1853 1080.3243 1112.7288 1113.2286 1115.5911 1122.9837 1126.6083 1129.6987 1135.4334 1135.5894 1138.9679 1154.2348 1223.5037 1250.4417 1251.1218 1256.9539 1259.0187 1273.2486 1312.9097 1335.4028 1356.0754 1360.4124 1375.2494 1378.8959 1393.2573 1394.3215 1399.7362 1399.7754 1457.5711 1457.6009 1462.6539 1462.6632 1472.9777 1473.2729 1477.9535 1478.0732 1485.7335 1485.7719 1488.6517 1488.8594 1626.3133 1636.7571 2937.9803 2938.2559 2985.3480 2988.3313 2994.8807 2994.9941 2996.0876 2996.1624 3007.0861 3007.2267 3012.1145 3012.1981 3072.8481 3072.8644 3092.5141 3092.5604 3092.8079 3092.8332 3103.0607 3103.1432 3109.9884 3110.0288
redmass: 3.5014 3.9992 3.3948 1.9370 2.3055 2.9756 2.1831 2.8042 2.6703 5.2681 3.1674 3.1336 4.8277 3.8375 2.9254 2.7459 2.1524 1.2667 1.2413 1.4456 1.6693 4.3046 4.0579 5.2634 6.4300 4.7973 3.2511 3.4122 4.5913 5.1415 4.1526 9.1622 6.8746 5.6322 4.7417 1.1528 1.1268 2.9596 3.3600 1.1054 1.1341 3.9314 6.2361 2.8701 5.2266 2.5820 2.5262 2.3465 2.6469 4.2271 4.3890 7.6526 2.4405 2.2844 2.2070 2.8680 2.5258 1.5488 1.4656 1.4697 1.6983 2.2450 1.6629 1.1360 1.1386 1.1425 1.1486 1.1293 1.3099 1.3868 1.3805 1.4560 1.2943 1.2899 1.2869 1.3089 1.2688 1.2693 1.0409 1.0408 1.0399 1.0399 1.0662 1.0647 1.0558 1.0552 1.0641 1.0659 1.0748 1.0767 10.2977 9.6127 1.0599 1.0599 1.0822 1.0837 1.0358 1.0359 1.0359 1.0359 1.1017 1.1018 1.0583 1.0583 1.1064 1.1064 1.0986 1.0986 1.0989 1.0989 1.1011 1.1011 1.1027 1.1027
irintensity: 0.6882 3.1557 0.0240 0.0254 0.0392 2.6519 0.7021 1.1569 7.2783 0.6357 0.2446 1.4625 0.3484 3.3148 0.1507 4.5943 5.3534 1.8611 0.2348 0.7361 3.6795 0.2395 1.7701 0.0915 19.0188 7.5872 11.5018 1.8792 14.4667 9.0934 0.2450 3.6172 20.8094 0.7875 5.0151 0.8421 7.2789 1.1274 8.2717 1.2418 6.3653 6.6865 1.3406 1.4151 15.5899 0.2225 12.6480 71.0299 17.1282 12.3378 82.2799 297.5821 90.0466 1.3659 35.8764 462.6727 21.7212 0.2327 0.0436 16.1497 86.8716 19.9645 36.2522 0.3878 1.3152 4.9677 0.0359 5.3711 0.6166 39.3806 0.0086 7.3826 0.8266 0.1917 43.7219 4.1953 52.3140 1.0000 2.7575 19.1387 2.4459 20.3746 0.0674 5.4471 13.1636 1.6976 22.7282 2.7416 8.4961 1.5982 276.7618 60.8205 105.0103 12.5485 30.0494 14.5942 41.0461 10.1588 42.8418 0.0037 7.8218 43.1227 9.0610 27.7978 0.0810 10.7565 14.9780 38.9405 51.4338 18.1879 5.6615 63.0645 2.0836 79.1291
temp: 298.150 k
press: 1.00000 atm
elementType: 8 8 8 8 8 8 6 6 6 6 6 6 6 6 6 6 6 6 1 1 1 1 1 1 1 1 1 1 1 1 1 1 1 1 1 1 1 1 1 1
symmnumber: 1
zpe: 866869.7 jmol-1
zpe.correction: 0.330173 hartree
zpe.thermalcorrener: 0.353268 hartree
zpe.thermalcorrenthalpy: 0.354212 hartree
zpe.thermalcorrgfe: 0.271963 hartree
zpe.sumelectzpe: -920.325628 hartree
zpe.sumelectthermal: -920.302533 hartree
zpe.sumelectthermalent: -920.301588 hartree
zpe.sumelectthermalfe: -920.383838 hartree
dipole: -0.0002 -0.0004 0.7726
dipole: 0.7726
quadrupole: -96.5528 -97.0415 -106.0772
quadrupole: 5.7056 -0.0002 0.0008
quadrupole: 3.3377 2.8490 -6.1867 5.7056 -0.0002 0.0008
hfenergy: -920.6558008 hartree
pointgroup: C01 [X(C12H22O6)]
dipole: -0.0000484 -0.000215 -0.3039825 debye
polarizability: 176.2459547|-7.680436|147.2430637|-0.0006177|-0.0019329|136.49162 unknown
InChI: InChI=1S/C12H22O6/c1-5-15-9(11(13)17-7-3)10(16-6-2)12(14)18-8-4/h9-10H,5-8H2,1-4H3
charge 0 multiplicity 1
40 atoms
O  -1.640713 -0.735716 -1.224493
O  1.640875 0.735656 -1.224693
O  1.290682 -2.071029 0.419482
O  -1.290719 2.071141 0.418962
O  -0.708718 -1.44935 1.444592
O  0.708796 1.450045 1.444199
C  -0.225054 -0.746403 -0.894246
C  0.225214 0.746444 -0.894462
C  0.056572 -1.441921 0.453975
C  -0.056436 1.44238 0.453539
C  -2.227013 -2.084177 -1.376959
C  2.227193 2.084066 -1.377556
C  -3.661185 -1.890901 -1.865023
C  3.661332 1.890631 -1.865655
C  1.773925 -2.641187 1.718972
C  -1.774073 2.641429 1.718353
C  3.170327 -3.19518 1.460241
C  -3.170574 3.195128 1.459523
H  0.379083 -1.250996 -1.676747
H  -0.378916 1.250804 -1.67712
H  -1.625955 -2.667385 -2.109435
H  -2.206923 -2.608648 -0.400337
H  1.626105 2.667091 -2.110153
H  2.207171 2.608795 -0.401071
H  -4.232058 -1.287227 -1.138998
H  -3.6766 -1.370174 -2.837882
H  -4.162685 -2.869146 -1.979916
H  3.676677 1.369649 -2.838379
H  4.232238 1.287136 -1.139507
H  4.162845 2.868836 -1.980835
H  1.05798 -3.418258 2.043002
H  1.76806 -1.827047 2.46535
H  -1.05827 3.418681 2.042265
H  -1.768068 1.827407 2.464859
H  3.145733 -3.991182 0.696349
H  3.846825 -2.397345 1.110481
H  3.582871 -3.620255 2.393512
H  -3.146114 3.991013 0.695505
H  -3.846926 2.397117 1.109882
H  -3.583202 3.620278 2.392723
