program: Gaussian 09
title: 000096011
version: EM64L-G09RevD.01
frameworkgroup: C1[X(C12H22O6)]
method: RPBEPBE
basis: SDD
operation: Freq
keyword: #pfreq=noraman
keyword: PBEPBE/SDD
title: #p freq=noraman PBEPBE/SDD
converged: YES YES NO NO
title: Mulliken charges:
elementType: O O O O O O C C C C C C C C C C C C H H H H H H H H H H H H H H H H H H H H H H
charge: -0.328833 -0.292659 -0.268686 -0.270348 -0.493337 -0.482214 -0.136346 -0.069399 -0.113189 -0.098013 -0.363138 -0.371989 0.366515 0.346972 -0.697544 -0.688440 -0.693761 -0.703165 0.241256 0.238220 0.231056 0.217315 0.247846 0.222027 0.216889 0.245467 0.229614 0.230984 0.223563 0.238226 0.226375 0.216693 0.213128 0.275593 0.216789 0.238168 0.218082 0.218332 0.376825 0.375124
chargesum: 0.00000
title: Mulliken charges with hydrogens summed into heavy atoms:
elementType: O O O O O O C C C C C C C C C C C C
charge: -0.328833 -0.292659 -0.268686 -0.270348 -0.116512 -0.107090 0.104909 0.168821 0.117867 0.119302 0.106736 0.090368 0.366515 0.346972 -0.013383 -0.007146 0.011750 -0.028583
polarizability: 1.93998724e+02 1.84348270e+00 1.31023671e+02 7.59149234e+00 -7.12436483e-01 1.22786748e+02
1716.lowfreq: -8.2471 0.0003 0.0004 0.0008 9.4530 18.0626 22.0835 32.7473 38.5391
frequency: 20.5129 32.2547 38.3980 62.3901 92.7029 101.4699 134.4377 148.0501 166.1941 170.8083 177.1996 197.3856 221.3135 229.3501 250.2990 273.9341 294.7636 308.8110 321.5571 335.8815 344.6438 364.0071 400.9762 410.3801 463.5659 469.8902 482.8543 496.2880 504.6744 587.6601 603.7919 611.8182 628.1527 654.4267 697.8018 735.4799 738.8138 746.8001 759.2501 840.8424 845.5943 899.8100 918.8540 920.0056 931.6002 938.2767 945.5760 967.9856 981.6310 983.8364 988.8148 993.5823 1012.3917 1038.4253 1062.8533 1079.2003 1091.4029 1121.9693 1137.9492 1139.6767 1183.3106 1184.7817 1203.9915 1206.8924 1213.9173 1226.9675 1249.2274 1266.8575 1277.4180 1283.7598 1295.8519 1306.1187 1317.1544 1322.1530 1351.4000 1364.3298 1378.7428 1378.9576 1381.4507 1389.4494 1392.0355 1393.3007 1451.2583 1452.1237 1452.5765 1456.5908 1467.4410 1469.9019 1471.4157 1473.6398 1474.2157 1489.4970 2963.5457 2977.6190 2984.4961 2991.9899 2992.8343 2995.0041 3003.8356 3006.2126 3007.3286 3020.6698 3092.6143 3094.3777 3097.0662 3098.0519 3106.0863 3106.2515 3107.5084 3108.3469 3116.0978 3119.3055 3509.5452 3513.2008
redmass: 3.9896 3.4493 4.4120 3.9773 6.4536 4.6944 3.1468 2.2932 1.4927 2.1320 1.1113 2.5848 1.1049 1.1546 3.4944 3.3929 3.6809 3.2739 3.1486 3.3742 2.8193 3.1304 2.8774 2.9930 1.7136 2.6558 2.4873 1.6364 1.6543 3.0579 3.6332 4.3902 3.9150 4.4262 4.8478 6.9886 7.0905 3.2313 3.7931 3.9673 3.2617 3.7110 1.6217 1.7364 2.2294 2.5043 2.1142 3.5983 1.3420 1.9980 3.0858 2.6372 2.9772 2.4579 2.6986 2.5691 2.6077 2.4689 2.0704 1.8670 1.1991 1.2997 2.4376 1.2720 2.1875 1.1908 3.1648 3.0927 1.2101 1.3383 1.3670 1.1410 1.2942 1.2099 1.4439 1.3916 1.4288 1.3152 1.3340 1.5397 1.2272 1.2274 1.0529 1.0481 1.0514 1.0491 1.0869 1.0647 1.0590 1.0533 1.0694 1.0623 1.0820 1.0841 1.0845 1.0435 1.0353 1.0609 1.0364 1.0354 1.0813 1.0590 1.0997 1.1005 1.1069 1.0999 1.1013 1.1010 1.0995 1.0997 1.1007 1.1008 1.0646 1.0648
irintensity: 0.1706 0.2792 0.3599 1.3275 3.8861 3.9935 3.5547 4.3563 3.4748 1.8498 0.4916 2.4343 0.8104 0.4342 0.9177 8.6088 14.3742 5.7904 2.1308 10.8580 1.0642 1.3893 0.8028 3.3751 100.3528 30.0325 60.4323 62.8761 130.4480 2.3372 6.4150 2.7559 18.9852 9.6188 12.1100 2.2545 19.1257 41.2339 79.4556 73.4710 2.3335 26.5108 0.3867 0.5155 0.9632 9.6072 21.4751 48.5984 0.9269 59.8880 25.5420 200.1985 14.6640 28.6107 23.8247 6.3850 59.7041 6.9004 89.4755 19.2095 57.5217 18.6640 72.7899 32.9207 85.7151 33.3762 49.7627 56.1854 8.4699 3.0835 4.1641 19.4612 10.0314 11.8336 3.3123 2.6427 11.1892 44.8176 75.6594 1.4954 29.7964 37.2100 6.3710 0.6974 3.5442 0.6819 6.0515 6.3947 10.0082 8.3906 21.2290 3.9158 3.9724 29.6129 110.5983 10.5333 17.1077 19.9212 10.0690 18.4078 59.8526 31.9966 11.7159 19.8546 21.5358 11.3864 4.6436 16.3215 27.4027 26.9902 24.0395 22.8269 46.0335 21.7028
temp: 298.150 k
press: 1.00000 atm
elementType: 8 8 8 8 8 8 6 6 6 6 6 6 6 6 6 6 6 6 1 1 1 1 1 1 1 1 1 1 1 1 1 1 1 1 1 1 1 1 1 1
symmnumber: 1
zpe: 875415.1 jmol-1
zpe.correction: 0.333428 hartree
zpe.thermalcorrener: 0.353387 hartree
zpe.thermalcorrenthalpy: 0.354331 hartree
zpe.thermalcorrgfe: 0.284588 hartree
zpe.sumelectzpe: -920.316216 hartree
zpe.sumelectthermal: -920.296257 hartree
zpe.sumelectthermalent: -920.295313 hartree
zpe.sumelectthermalfe: -920.365056 hartree
dipole: 3.2742 0.3528 0.5050
dipole: 3.3316
quadrupole: -104.8908 -111.1179 -111.8686
quadrupole: 3.1252 5.3790 -1.3069
quadrupole: 4.4017 -1.8255 -2.5762 3.1252 5.3790 -1.3069
hfenergy: -920.6496439 hartree
pointgroup: C01 [X(C12H22O6)]
dipole: 1.2850628 0.1272926 0.2247541 debye
polarizability: 193.8835768|1.6914475|131.0734673|8.1124554|0.8021767|122.8520983 unknown
InChI: InChI=1S/C12H22O6/c1-11(2)15-5-7(17-11)9(13)10(14)8-6-16-12(3,4)18-8/h7-10,13-14H,5-6H2,1-4H3
charge 0 multiplicity 1
40 atoms
O  2.903415 -0.074436 0.952778
O  -2.624219 -0.722762 -0.83856
O  3.352697 -1.114756 -1.131315
O  -3.739008 -0.976601 1.21231
O  1.220452 1.995308 0.364493
O  -1.433808 1.911652 0.189059
C  0.619737 0.687934 0.675844
C  -0.710527 0.675543 -0.115153
C  1.608641 -0.435783 0.307912
C  -1.607861 -0.531373 0.22052
C  1.987123 -0.554674 -1.182711
C  -2.421648 -0.400868 1.542301
C  4.022681 -0.500685 0.035685
C  -3.982643 -0.650675 -0.209012
C  4.802624 0.757232 -0.366282
C  4.86294 -1.579608 0.714042
C  -4.554561 0.765066 -0.375704
C  -4.847017 -1.75778 -0.803607
H  0.408642 0.63348 1.765331
H  -0.48064 0.638809 -1.200902
H  1.264221 -1.408678 0.708478
H  -0.986715 -1.449123 0.224004
H  1.372115 -1.271723 -1.747042
H  1.976479 0.436448 -1.67731
H  -2.013955 -1.004479 2.368416
H  -2.510578 0.658886 1.840011
H  5.658592 0.482451 -1.006243
H  4.155774 1.453566 -0.927629
H  5.185871 1.272231 0.532071
H  4.215169 -2.408039 1.043066
H  5.611017 -1.974785 0.005256
H  5.386884 -1.16321 1.590956
H  -5.507017 0.852059 0.176165
H  -3.83887 1.518485 -0.007978
H  -4.742475 0.967141 -1.444735
H  -4.379685 -2.737436 -0.615399
H  -5.850518 -1.742719 -0.344723
H  -4.951763 -1.610395 -1.891627
H  2.135292 1.982321 0.754577
H  -0.765359 2.646478 0.14166
