program: Gaussian 09
title: 000094021
version: EM64L-G09RevD.01
frameworkgroup: C1[X(C12H20O3)]
method: RPBEPBE
basis: SDD
operation: Freq
keyword: #pfreq=noraman
keyword: PBEPBE/SDD
title: #p freq=noraman PBEPBE/SDD
converged: YES YES NO NO
title: Mulliken charges:
elementType: O O O C C C C C C C C C C C C H H H H H H H H H H H H H H H H H H H H
charge: -0.321483 -0.273695 -0.249453 0.419349 -0.221421 0.007551 -0.491451 -0.500788 -0.469170 -0.111147 -0.771204 -0.331321 -0.745604 0.303199 -0.755917 0.212280 0.234307 0.221632 0.226808 0.216340 0.197740 0.203515 0.226942 0.213755 0.235190 0.223354 0.213058 0.238364 0.249561 0.220573 0.229120 0.210555 0.246032 0.246126 0.247303
chargesum: 0.00000
title: Mulliken charges with hydrogens summed into heavy atoms:
elementType: O O O C C C C C C C C C C C C
charge: -0.321483 -0.273695 -0.249453 0.419349 -0.009141 0.241858 -0.043011 -0.086707 -0.038713 0.102608 -0.099603 0.156605 -0.085356 0.303199 -0.016456
polarizability: 1.56699539e+02 2.70896224e+00 1.25379352e+02 7.68406920e+00 -7.36299994e-01 1.20213008e+02
1716.lowfreq: -15.8578 -6.5027 -3.8575 0.0002 0.0007 0.0007 16.4434 26.9832 40.0696
frequency: 15.9143 26.1779 40.0272 57.1519 75.5095 113.8257 152.7703 169.2146 177.6714 186.7281 211.9105 213.5440 243.7596 300.0135 305.8622 346.2665 377.3914 402.9102 411.1843 436.4580 450.9371 527.6059 565.1378 568.7440 604.3384 610.9084 623.3037 732.0160 790.4333 799.5430 834.4724 865.3107 886.4383 908.2674 920.1290 931.5264 960.6126 968.4923 997.4941 999.7753 1014.9541 1040.1380 1042.7138 1058.0220 1085.9259 1087.6409 1118.6361 1145.7547 1153.0142 1180.7404 1203.0217 1204.2252 1213.4176 1234.1189 1247.2589 1274.7255 1297.9219 1306.4071 1317.1691 1329.1918 1343.2559 1349.6945 1356.4272 1365.7031 1383.1295 1389.6774 1392.3683 1419.3136 1448.0464 1449.9219 1454.3093 1456.4006 1458.9344 1467.7971 1472.6813 1476.4738 1482.0694 1485.2933 1648.2538 2946.3036 2964.2449 2967.5333 2970.7433 2978.7059 2984.2975 2993.8004 3005.5931 3012.7569 3024.9682 3031.7701 3057.0269 3066.9840 3071.1433 3071.6927 3075.6341 3090.4345 3091.2500 3097.7663 3141.1716
redmass: 8.0733 3.4274 3.7862 1.0365 3.2424 3.1442 3.5024 1.1815 1.5505 1.9119 2.0457 4.3440 2.4670 3.1354 2.6510 2.2615 2.5321 2.6906 2.2932 2.7969 3.2035 3.4574 3.3609 3.6343 2.9715 3.8854 4.4708 3.4305 1.9487 4.3232 3.2257 2.8731 1.7127 1.9345 2.6159 1.8875 2.0741 1.6229 1.8388 1.4809 1.7559 1.7800 1.6760 1.5954 2.2323 2.0582 2.1061 2.4666 1.7548 1.3636 2.3648 1.5724 1.6528 1.2979 1.3863 1.2935 1.3702 1.2888 1.4813 1.5072 1.4102 1.8435 1.3442 1.7103 1.2473 1.2466 1.2174 2.1882 1.0821 1.0935 1.0604 1.0519 1.0904 1.0979 1.0875 1.1846 1.0587 1.0600 9.4610 1.0804 1.0715 1.0595 1.0733 1.0375 1.0367 1.0632 1.0383 1.0588 1.0971 1.0980 1.1018 1.0981 1.1043 1.0909 1.1012 1.0991 1.0992 1.0945 1.1020
irintensity: 1.8704 0.3267 1.0686 0.3169 2.0455 1.0963 2.8719 1.3582 0.3218 4.3903 4.2325 3.1904 0.9165 3.4438 2.2067 4.8581 4.6289 2.1325 1.8808 2.0775 5.9291 4.1098 3.8211 1.1302 2.6978 4.2438 7.0059 11.6221 3.3603 10.1642 10.6313 0.6457 6.2781 3.9130 34.4518 14.1922 0.4837 46.2344 81.0079 11.8314 8.2100 5.4071 9.7244 5.2829 2.6337 0.6481 11.6811 2.9380 7.2896 3.0924 279.8052 95.1906 24.2488 9.1216 3.6165 0.2623 4.1080 2.8075 4.6019 6.0224 0.1180 2.1473 4.5234 8.6442 49.9906 19.1816 21.2252 8.1581 14.5852 3.4775 25.7055 20.2817 3.9201 9.4567 8.6524 7.9120 9.4536 21.0287 219.3264 8.1027 21.3213 16.8776 39.5610 41.4045 23.1993 27.8829 2.1305 27.9604 32.5972 21.6171 38.0825 27.8808 22.9804 41.7123 49.4919 24.6094 39.4027 9.8060 10.4414
temp: 298.150 k
press: 1.00000 atm
elementType: 8 8 8 6 6 6 6 6 6 6 6 6 6 6 6 1 1 1 1 1 1 1 1 1 1 1 1 1 1 1 1 1 1 1 1
symmnumber: 1
zpe: 785398.3 jmol-1
zpe.correction: 0.299142 hartree
zpe.thermalcorrener: 0.315913 hartree
zpe.thermalcorrenthalpy: 0.316858 hartree
zpe.thermalcorrgfe: 0.252663 hartree
zpe.sumelectzpe: -693.726638 hartree
zpe.sumelectthermal: -693.709867 hartree
zpe.sumelectthermalent: -693.708923 hartree
zpe.sumelectthermalfe: -693.773117 hartree
dipole: 0.3142 -0.3080 3.2147
dipole: 3.2447
quadrupole: -107.8412 -85.1474 -92.9824
quadrupole: -1.6426 -0.4036 -3.4529
quadrupole: -12.5176 10.1763 2.3413 -1.6426 -0.4036 -3.4529
hfenergy: -694.0257808 hartree
pointgroup: C01 [X(C12H20O3)]
dipole: 0.1217191 -0.0593468 1.2693438 debye
polarizability: 156.7952128|2.5034017|125.1866276|7.5399618|-1.1333527|120.3100582 unknown
InChI: InChI=1S/C12H20O3/c1-8(7-14-9(2)13)10-4-5-12(3)11(6-10)15-12/h8,10-11H,4-7H2,1-3H3
charge 0 multiplicity 1
35 atoms
O  3.301032 -0.432798 -1.229005
O  -2.444174 -0.086573 0.305493
O  -4.368318 -0.706253 -0.854503
C  3.123416 -0.608319 0.274271
C  2.097398 -1.175684 -0.666368
C  0.418134 0.663272 0.054625
C  0.741744 -0.521554 -0.901609
C  2.79068 0.687119 1.006874
C  1.69336 1.511122 0.297802
C  -0.770777 1.523653 -0.48002
C  4.153561 -1.515655 0.921109
C  -1.98347 0.676021 -0.897176
C  -1.217763 2.616675 0.522086
C  -3.671517 -0.745976 0.184786
C  -3.994479 -1.508631 1.452009
H  2.151219 -2.253945 -0.877673
H  0.103215 0.236688 1.030578
H  -0.039378 -1.299007 -0.803078
H  0.719352 -0.173635 -1.955401
H  3.715503 1.288656 1.109504
H  2.459202 0.428336 2.033969
H  1.46155 2.394964 0.919144
H  2.084029 1.87655 -0.672122
H  -0.426913 2.022785 -1.413816
H  4.353652 -2.39591 0.286534
H  5.108467 -0.978202 1.069461
H  3.802901 -1.867524 1.909901
H  -2.819243 1.307512 -1.24914
H  -1.748567 -0.053442 -1.691886
H  -0.412221 3.340882 0.730271
H  -1.53003 2.159895 1.47868
H  -2.077564 3.185502 0.121829
H  -3.679978 -0.943197 2.343468
H  -3.446907 -2.469005 1.454401
H  -5.073013 -1.721323 1.489801
