program: Gaussian 09
title: 000049390
version: EM64L-G09RevD.01
frameworkgroup: C1[X(C15H10F3NO2)]
method: RPBEPBE
basis: SDD
operation: Freq
keyword: #p
keyword: freq=noraman
keyword: PBEPBE/SDD
title: #p freq=noraman PBEPBE/SDD
converged: YES YES NO NO
title: Mulliken charges:
elementType: F F F O O N C C C C C C C C C C C C C C C H H H H H H H H H H
charge: -0.140909 -0.127542 -0.182644 -0.351857 -0.198272 -0.195502 -0.694422 0.319642 0.184362 0.277009 0.186892 -0.558504 -0.373631 0.469557 -0.419090 -0.392032 -0.432994 -0.233464 -0.232735 0.128976 0.309775 0.250334 0.253825 0.305269 0.244967 0.244225 0.239377 0.279342 0.228392 0.228366 0.383289
chargesum: 0.00000
title: Mulliken charges with hydrogens summed into heavy atoms:
elementType: F F F O O N C C C C C C C C C C C C C C C
charge: -0.140909 -0.127542 -0.182644 0.031432 -0.198272 -0.195502 -0.190263 0.319642 0.184362 0.277009 0.186892 -0.253235 -0.128664 0.469557 -0.174865 -0.152655 -0.153652 -0.005072 -0.004369 0.128976 0.309775
polarizability: 3.32608884e+02 -7.89690994e-01 1.81326120e+02 -4.69132867e-01 -1.03124333e+00 8.29022349e+01
1716.lowfreq: -8.9526 -3.9120 -1.4771 -0.0008 0.0001 0.0004 19.5033 28.4752 59.5067
frequency: 19.4113 28.4459 59.5039 87.6265 88.6136 133.6989 159.5760 170.0900 182.5086 222.9763 239.7405 261.4838 288.8890 306.0768 320.0860 350.2592 363.5732 370.4638 420.7274 434.6144 441.2407 457.7033 489.4244 507.3833 515.1542 548.0605 588.3749 609.4083 619.7143 642.0695 671.7016 681.4737 705.2557 733.3257 741.2162 772.3730 778.4820 820.4863 845.5238 869.4813 884.8949 890.4427 940.4613 966.5893 973.0414 988.5137 988.7437 995.7154 1016.2217 1025.3755 1066.1679 1093.3497 1098.9986 1128.6298 1133.3312 1156.8134 1169.8773 1188.8252 1203.5933 1209.2872 1252.8396 1295.7767 1306.0779 1331.7326 1348.3638 1379.7172 1392.2319 1425.4176 1443.6888 1444.6121 1463.9788 1484.3554 1584.0847 1590.1467 1607.5087 1620.7702 1622.7322 2986.0657 3030.7783 3123.7960 3130.5196 3142.0822 3144.4271 3162.9698 3187.8249 3192.4865 3447.7200
redmass: 6.1248 9.3939 8.5539 7.8406 10.2347 3.7789 5.5695 9.2401 6.2113 4.3091 2.2813 3.6712 5.4045 1.9724 6.9369 8.2860 12.7832 5.5532 2.7728 2.8731 9.1069 12.8545 6.0109 3.5586 5.1617 6.1655 3.4192 9.1670 10.1188 7.3520 7.8353 12.0289 3.1652 5.7806 1.7002 7.1162 2.0321 4.7268 1.4642 1.4046 3.1818 1.7381 1.5384 1.5688 1.5833 4.9297 1.4711 7.3729 5.8902 2.1981 6.5020 5.8165 2.2373 1.9264 1.1501 1.7244 1.1545 1.7056 1.7404 3.2450 1.9963 1.5664 1.8615 2.5909 1.7884 8.1817 3.6036 1.1715 4.4715 2.3635 2.8520 3.5393 7.7311 6.6523 11.7535 7.4185 7.2507 1.0610 1.0993 1.0856 1.0896 1.0911 1.0942 1.1003 1.0936 1.0931 1.0681
irintensity: 1.6920 0.2543 0.6331 1.5287 1.9768 1.9565 5.8308 6.7107 0.1818 25.7650 12.5302 42.5735 24.1375 37.3882 48.5444 4.0563 1.6974 3.2674 11.4602 1.1513 3.0661 4.1951 3.6525 0.7706 2.2494 0.1472 6.1493 3.7591 32.7577 9.4858 1.7210 11.3914 0.0319 11.5013 50.5259 22.6004 55.8776 3.0403 32.6995 0.3179 14.0061 14.4531 2.8546 10.4631 2.0456 99.8766 15.5668 51.0007 98.5613 7.7389 167.5853 257.5236 26.0605 27.8981 0.1817 78.1664 4.5251 3.7747 15.9298 9.1527 2.7486 6.0143 3.1372 29.3411 50.8884 11.7343 4.1905 15.6023 22.1265 43.6110 11.9355 21.9063 17.1933 3.7497 344.8270 2.2182 1.0392 8.8094 5.6196 3.6688 2.5792 3.0720 34.0200 40.6606 0.8872 1.4846 32.9973
temp: 298.150 k
press: 1.00000 atm
elementType: 9 9 9 8 8 7 6 6 6 6 6 6 6 6 6 6 6 6 6 6 6 1 1 1 1 1 1 1 1 1 1
symmnumber: 1
zpe: 567076.5 jmol-1
zpe.correction: 0.215988 hartree
zpe.thermalcorrener: 0.233452 hartree
zpe.thermalcorrenthalpy: 0.234396 hartree
zpe.thermalcorrgfe: 0.169382 hartree
zpe.sumelectzpe: -1080.812597 hartree
zpe.sumelectthermal: -1080.795133 hartree
zpe.sumelectthermalent: -1080.794189 hartree
zpe.sumelectthermalfe: -1080.859203 hartree
dipole: -4.3045 1.9393 2.0204
dipole: 5.1353
quadrupole: -124.1288 -110.5893 -121.9196
quadrupole: 8.5346 5.8110 0.7218
quadrupole: -5.2495 8.2899 -3.0404 8.5346 5.8110 0.7218
hfenergy: -1081.0285849 hartree
pointgroup: C01 [X(C15H10F3N1O2)]
dipole: -1.6934465 0.6520405 0.8882803 debye
polarizability: 332.5213033|2.0908918|180.624007|-4.097409|8.4355513|83.6919284 unknown
InChI: InChI=1S/C15H10F3NO2/c16-15(17,18)14(20)19(21)11-5-6-13-10(8-11)7-9-3-1-2-4-12(9)13/h1-6,8,21H,7H2
charge 0 multiplicity 1
31 atoms
F  5.323601 0.766872 -1.062622
F  5.574158 -1.345697 -0.32122
F  5.115369 0.294294 1.165358
O  3.070214 1.81916 0.26637
O  2.942905 -1.63419 -0.736088
N  2.44935 0.5286 0.037425
C  -2.126947 -1.767142 -0.024625
C  -1.12054 -0.62296 -0.006095
C  -1.80703 0.629625 0.011347
C  -3.467391 -1.040385 -0.009507
C  -3.257769 0.373573 0.010018
C  0.27891 -0.692379 -0.008049
C  -1.069519 1.833541 0.020502
C  1.009548 0.530787 0.004264
C  -4.770364 -1.567559 -0.013516
C  -4.355483 1.263198 0.024416
C  0.339029 1.784097 0.014213
C  -5.871593 -0.674537 0.001178
C  -5.66409 0.72799 0.01975
C  3.30504 -0.498611 -0.333873
C  4.824811 -0.179669 -0.15162
H  -2.007352 -2.437432 0.848863
H  -2.008568 -2.400492 -0.925497
H  0.801287 -1.649573 -0.040305
H  -1.574126 2.805515 0.023588
H  -4.939132 -2.65041 -0.028689
H  -4.202852 2.348291 0.038442
H  0.927272 2.704039 -0.000442
H  -6.893348 -1.070175 -0.00249
H  -6.528068 1.401766 0.030256
H  3.22498 1.870565 1.25295
