program: Gaussian 09
title: 000074279
version: EM64L-G09RevD.01
frameworkgroup: C1[X(C10H20O2)]
method: RPBEPBE
basis: SDD
operation: Freq
keyword: #pfreq=noraman
keyword: PBEPBE/SDD
title: #p freq=noraman PBEPBE/SDD
converged: YES YES NO NO
title: Mulliken charges:
elementType: O O C C C C C C C C C C H H H H H H H H H H H H H H H H H H H H
charge: -0.298766 -0.298022 0.383321 -0.510839 -0.473967 -0.373349 -0.398225 -0.393074 -0.226680 -0.226754 -0.690403 -0.690275 0.228079 0.222209 0.206693 0.220647 0.204001 0.196174 0.190692 0.221900 0.186749 0.202032 0.198252 0.212511 0.193356 0.215538 0.202714 0.220003 0.226336 0.203111 0.220915 0.225121
chargesum: 0.00000
title: Mulliken charges with hydrogens summed into heavy atoms:
elementType: O O C C C C C C C C C C
charge: -0.298766 -0.298022 0.383321 -0.060551 -0.046627 0.026827 0.014366 -0.004293 0.184082 0.182140 -0.041350 -0.041128
polarizability: 1.27636184e+02 -1.56572417e-01 1.13175652e+02 -8.57665040e-01 2.06297065e+00 1.00180918e+02
1716.lowfreq: -22.0367 -0.0007 -0.0006 -0.0005 9.9126 11.0028 40.1538 60.6964 94.4827
frequency: 39.6857 60.6407 94.4422 107.5706 129.6259 133.2253 177.2610 227.4318 238.2571 254.0416 279.6117 294.0990 320.1740 353.4463 369.2117 428.8317 451.3369 492.2637 531.7110 613.8484 707.6151 776.6931 793.1800 816.6521 818.9255 829.4983 864.5088 878.1692 908.9852 919.9832 932.2376 958.8579 1030.8493 1034.9004 1046.9468 1052.4950 1075.7513 1094.4813 1109.0413 1109.6148 1135.4722 1140.6268 1145.6420 1151.8270 1241.8123 1247.7430 1249.6775 1254.0725 1266.9466 1282.5623 1321.7735 1333.6947 1337.9825 1341.0501 1353.7486 1359.0962 1364.5524 1389.4218 1392.7154 1453.7215 1458.3350 1458.6552 1460.2752 1461.8460 1468.0917 1475.2715 1479.1960 1481.9481 1494.7401 1498.1458 2952.2175 2958.0271 2962.9446 2978.8663 2986.1488 2988.3762 2988.7318 2993.0382 3004.0054 3015.8583 3018.9863 3030.0196 3038.6345 3048.6127 3060.9788 3065.8650 3085.5005 3085.7705 3094.7164 3095.7839
redmass: 2.6973 2.5202 2.0394 2.1039 2.4551 3.0237 2.2020 2.3119 1.1857 1.3771 2.3798 2.9689 3.2384 2.3186 2.8559 2.7640 2.6424 1.9902 3.4057 3.1976 3.9600 1.4811 2.2707 1.1025 1.1260 2.7795 1.7956 2.2496 2.6943 2.2874 1.5042 2.6797 2.9692 2.8667 2.0180 3.1765 1.2625 1.5563 1.9848 2.0281 1.4824 1.4895 1.6708 2.3798 1.5727 1.2755 1.1759 1.2185 1.3815 1.5038 1.6446 1.4487 1.4178 1.4511 1.3292 1.4643 1.3217 1.2608 1.2629 1.0841 1.0857 1.0466 1.0419 1.0888 1.0815 1.0841 1.0545 1.0438 1.0850 1.0837 1.0587 1.0568 1.0631 1.0617 1.0602 1.0359 1.0361 1.0627 1.0633 1.1031 1.1044 1.0959 1.0998 1.1007 1.1017 1.1018 1.0989 1.0989 1.1011 1.1011
irintensity: 0.0533 0.2224 2.4589 1.3868 0.5775 1.2060 9.4139 1.4295 0.0561 3.2365 2.5665 2.3616 0.3600 5.9742 7.8432 0.2329 0.6005 3.5417 3.0469 2.5971 2.2493 5.0654 30.7138 8.0281 1.1826 3.6472 9.2388 0.7532 113.7831 24.2416 17.9111 16.1281 94.5175 21.2345 15.8526 150.5629 3.7655 1.7878 7.4730 3.8276 3.9800 2.8022 6.1889 26.7566 6.8842 8.8545 3.0827 4.6700 27.1584 2.3339 5.6598 12.4448 1.0250 0.2250 10.9840 6.2597 0.2623 20.5118 21.2852 3.7504 10.3871 13.9088 8.8587 3.8329 19.4259 7.2558 12.0642 2.1405 6.5016 0.8668 55.8763 42.8508 38.6770 30.7596 33.4281 27.7848 29.5724 36.0272 21.8013 25.1703 28.1888 60.6959 56.7030 32.4765 10.4681 80.0942 16.9135 59.8117 51.5705 36.3407
temp: 298.150 k
press: 1.00000 atm
elementType: 8 8 6 6 6 6 6 6 6 6 6 6 1 1 1 1 1 1 1 1 1 1 1 1 1 1 1 1 1 1 1 1
symmnumber: 1
zpe: 749519.2 jmol-1
zpe.correction: 0.285477 hartree
zpe.thermalcorrener: 0.299332 hartree
zpe.thermalcorrenthalpy: 0.300276 hartree
zpe.thermalcorrgfe: 0.245188 hartree
zpe.sumelectzpe: -542.499702 hartree
zpe.sumelectthermal: -542.485847 hartree
zpe.sumelectthermalent: -542.484903 hartree
zpe.sumelectthermalfe: -542.539991 hartree
dipole: 0.1417 0.2130 -0.1301
dipole: 0.2870
quadrupole: -71.9509 -72.5252 -76.6458
quadrupole: 0.9971 -2.1068 3.5083
quadrupole: 1.7564 1.1821 -2.9385 0.9971 -2.1068 3.5083
hfenergy: -542.7851791 hartree
pointgroup: C01 [X(C10H20O2)]
dipole: 0.053119 0.0827004 -0.0555863 debye
polarizability: 127.6228361|0.201604|113.3461724|-1.0773951|1.3921742|100.0237453 unknown
InChI: InChI=1S/C10H20O2/c1-3-11-10(12-4-2)8-6-5-7-9-10/h3-9H2,1-2H3
charge 0 multiplicity 1
32 atoms
O  1.190654 -0.889043 0.638657
O  0.168698 0.942631 -0.563171
C  -0.076099 -0.332652 0.137883
C  -0.950809 -0.173742 1.397729
C  -0.755076 -1.226377 -0.921009
C  -2.365881 0.338929 1.047255
C  -2.182723 -0.7317 -1.258024
C  -3.050922 -0.587337 0.013788
C  2.203189 -1.210506 -0.390083
C  0.765751 2.022556 0.248603
C  3.533284 -1.403081 0.339738
C  1.280904 3.080756 -0.728465
H  -0.444909 0.493593 2.11868
H  -1.017234 -1.167824 1.878837
H  -0.791859 -2.257111 -0.516695
H  -0.137017 -1.240865 -1.837047
H  -2.296075 1.361556 0.625323
H  -2.974918 0.407413 1.969113
H  -2.657596 -1.432491 -1.971766
H  -2.104447 0.250556 -1.761427
H  -3.209064 -1.58753 0.469179
H  -4.050446 -0.19188 -0.251254
H  1.912167 -2.138279 -0.92473
H  2.257709 -0.383051 -1.125398
H  -0.00224 2.455903 0.923319
H  1.584584 1.60848 0.8698
H  4.329933 -1.68006 -0.375489
H  3.832602 -0.474586 0.856848
H  3.447774 -2.20374 1.095086
H  1.714602 3.935994 -0.177709
H  2.0584 2.657273 -1.38811
H  0.458963 3.455013 -1.363561
