program: Gaussian 09
title: 000038280
version: EM64L-G09RevD.01
frameworkgroup: C1[X(C13H12O4)]
method: RPBEPBE
basis: SDD
operation: Freq
keyword: #pfreq=noraman
keyword: PBEPBE/SDD
title: #p freq=noraman PBEPBE/SDD
converged: YES YES NO NO
title: Mulliken charges:
elementType: O O O O C C C C C C C C C C C C C H H H H H H H H H H H H
charge: -0.259399 -0.237263 -0.149495 -0.267913 0.371440 0.183647 0.024716 -0.323906 -0.378342 -0.233481 -0.373338 0.085313 0.194311 -0.341887 -0.680024 -0.250701 -0.197009 0.223726 0.221823 0.291585 0.224847 0.224544 0.247666 0.269455 0.211443 0.228034 0.211181 0.239048 0.239981
chargesum: 0.00000
title: Mulliken charges with hydrogens summed into heavy atoms:
elementType: O O O O C C C C C C C C C C C C C
charge: -0.259399 -0.237263 -0.149495 -0.267913 0.371440 0.183647 0.024716 -0.032321 0.067207 0.215910 -0.125672 0.085313 0.194311 -0.072432 -0.029367 -0.011652 0.042972
polarizability: 2.81021134e+02 1.10483539e+01 1.50426081e+02 -1.86322511e+00 -1.66255302e-01 7.33156967e+01
1716.lowfreq: -10.6009 -7.7809 -4.0505 -0.0011 -0.0009 -0.0008 9.1834 45.3080 50.7225
frequency: 6.4465 45.2179 50.7032 60.1366 68.6549 98.3094 160.7128 175.2665 216.4776 219.5492 232.6739 295.0219 296.4220 318.4213 347.6905 397.8740 425.4736 449.4590 457.5121 545.3188 546.1431 579.8938 613.3294 662.4068 712.7790 733.7532 749.1055 752.5639 762.0942 769.3671 808.0300 843.6513 872.5773 875.3282 884.2244 895.7648 941.3574 952.7020 988.2380 994.5777 1022.4201 1049.1348 1078.8757 1117.8186 1136.1307 1140.4312 1171.9807 1201.8443 1210.9468 1224.1520 1265.5648 1279.1698 1288.8836 1310.3911 1353.8283 1371.4769 1395.3985 1407.5066 1435.7223 1468.1310 1475.3929 1476.8211 1480.3958 1489.4674 1555.0069 1576.1305 1600.5356 1623.1021 1706.1279 2979.0775 2997.2266 3010.1887 3047.2596 3063.6551 3085.0643 3088.1075 3136.6308 3137.9394 3147.5832 3168.8035 3181.5166
redmass: 4.8312 2.2817 3.5529 4.4441 4.3881 5.7858 3.5783 4.7761 2.1843 1.5305 5.3991 5.4980 5.0489 5.7492 9.1978 4.4945 7.4535 5.6001 3.0439 7.3207 3.8466 6.6875 8.0711 9.4309 8.1007 7.8515 3.7826 1.1178 4.8752 1.3710 6.4133 10.4655 1.4208 1.1586 3.0572 4.2365 3.0796 1.3553 1.4041 1.3828 2.1029 2.8886 4.3111 1.7603 2.2213 1.4648 1.1133 2.2565 2.9560 1.2640 1.8178 1.1022 1.8136 1.6714 2.4023 1.6360 1.2128 9.1818 2.5574 1.0788 2.9265 1.0579 1.0421 1.0873 6.8026 10.1399 6.9831 7.2468 12.8092 1.0362 1.0577 1.0597 1.1019 1.1041 1.0988 1.1050 1.0900 1.0897 1.0903 1.0957 1.0988
irintensity: 2.9143 0.9597 0.3094 1.8414 0.2582 0.0041 0.8076 2.1698 0.8158 0.7707 3.2327 6.1610 7.2719 16.2211 0.2342 1.8569 0.1646 0.3201 8.3567 0.3143 0.2292 28.1229 6.4338 0.4234 14.7475 12.1484 0.4703 11.2209 2.6150 110.2913 42.9613 33.8226 2.5750 2.0795 13.2975 8.9350 107.8441 0.0471 13.1903 4.1605 3.6409 18.3422 75.5649 16.1380 5.0971 0.5643 4.2971 601.6595 31.4127 0.5998 9.4317 0.0096 35.1432 38.7048 1.7185 3.0404 12.3360 2.3018 29.2669 3.5205 10.6902 4.6251 13.0997 19.6096 153.7763 127.5697 16.0883 185.0015 481.0361 36.2991 12.6133 25.9275 4.4415 0.5707 39.7261 85.0945 0.7280 0.1662 7.8363 16.2903 11.3534
temp: 298.150 k
press: 1.00000 atm
elementType: 8 8 8 8 6 6 6 6 6 6 6 6 6 6 6 6 6 1 1 1 1 1 1 1 1 1 1 1 1
symmnumber: 1
zpe: 578759.7 jmol-1
zpe.correction: 0.220438 hartree
zpe.thermalcorrener: 0.236064 hartree
zpe.thermalcorrenthalpy: 0.237009 hartree
zpe.thermalcorrgfe: 0.174361 hartree
zpe.sumelectzpe: -802.262878 hartree
zpe.sumelectthermal: -802.247251 hartree
zpe.sumelectthermalent: -802.246307 hartree
zpe.sumelectthermalfe: -802.308955 hartree
dipole: -2.6477 -2.2601 0.1790
dipole: 3.4857
quadrupole: -65.2083 -106.8129 -99.4580
quadrupole: 2.2419 -0.0280 -0.1035
quadrupole: 25.2847 -16.3198 -8.9649 2.2419 -0.0280 -0.1035
hfenergy: -802.4833156 hartree
pointgroup: C01 [X(C13H12O4)]
dipole: 1.0393958 -0.8944238 -0.0182579 debye
polarizability: 280.9322475|-11.4673401|150.4052842|2.4202233|-2.8746572|73.4253799 unknown
InChI: InChI=1S/C13H12O4/c1-2-7-16-12(14)10-8-9-5-3-4-6-11(9)17-13(10)15/h3-6,8H,2,7H2,1H3
charge 0 multiplicity 1
29 atoms
O  1.374868 1.659969 -0.144687
O  -2.647113 0.058556 -0.178626
O  -0.862823 2.175455 -0.155786
O  -1.784736 -2.094903 -0.010247
C  2.192785 -0.647054 -0.069929
C  2.432779 0.76009 -0.114467
C  -0.251763 -0.215679 -0.095838
C  0.826473 -1.09017 -0.061589
C  -4.996067 0.655618 -0.313521
C  -4.027668 -0.51882 -0.176905
C  3.311278 -1.531789 -0.038898
C  -0.047717 1.245556 -0.134351
C  -1.611475 -0.847985 -0.087076
C  3.744258 1.283044 -0.12852
C  -6.462672 0.169827 -0.322221
C  4.617682 -1.020954 -0.052217
C  4.829613 0.386989 -0.097122
H  -4.828934 1.360538 0.521374
H  -4.767613 1.205346 -1.244986
H  0.597358 -2.162431 -0.028417
H  -4.170468 -1.077494 0.766995
H  -4.108237 -1.234313 -1.016669
H  3.133257 -2.612634 -0.004955
H  3.887634 2.366509 -0.162827
H  -6.717794 -0.362089 0.613529
H  -7.154547 1.024447 -0.421819
H  -6.655169 -0.519075 -1.166099
H  5.475664 -1.699731 -0.028477
H  5.851546 0.780778 -0.107247
