program: Gaussian 09
title: 000088044
version: EM64L-G09RevD.01
frameworkgroup: C1[X(C9H8ClNO3)]
method: RPBEPBE
basis: SDD
operation: Freq
keyword: #p
keyword: freq=noraman
keyword: PBEPBE/SDD
title: #p freq=noraman PBEPBE/SDD
converged: YES YES NO NO
title: Mulliken charges:
elementType: Cl O O O N C C C C C C C C C H H H H H H H H
charge: -0.000709 -0.511479 -0.250225 -0.201683 -0.461382 0.354196 0.202545 -0.345313 -0.247921 -0.211293 -0.245997 0.215042 0.128101 -0.779622 0.321357 0.386420 0.241411 0.265766 0.258672 0.259607 0.222900 0.399608
chargesum: 0.00000
title: Mulliken charges with hydrogens summed into heavy atoms:
elementType: Cl O O O N C C C C C C C C C
charge: -0.000709 -0.111871 -0.250225 -0.201683 -0.074963 0.354196 0.202545 -0.023956 -0.247921 0.030119 0.019769 0.215042 0.128101 -0.038443
polarizability: 1.91326954e+02 1.32956611e+00 1.47571780e+02 -1.55489111e+00 3.69020955e-02 5.55078861e+01
1716.lowfreq: -9.8309 -5.4431 -0.0018 -0.0009 -0.0003 4.9166 18.5074 40.6722 50.2009
frequency: 17.9095 40.6712 50.1855 77.8467 123.6891 148.9140 197.6387 219.1426 261.7861 274.0508 319.0075 338.3216 381.5954 427.4166 455.4176 513.5608 534.7135 563.0236 583.9246 605.7390 608.8012 679.6052 710.9239 743.3998 765.0366 806.4094 850.7287 863.5453 920.3304 949.4975 967.1267 1003.2134 1003.4348 1042.9701 1072.8082 1125.6477 1167.2935 1198.4463 1232.6883 1264.3529 1316.0993 1337.7597 1388.6250 1407.8423 1447.1228 1450.8765 1468.2816 1530.0932 1576.6382 1606.5490 1644.7720 1660.9912 2997.9474 3095.9079 3105.4937 3151.5297 3182.2414 3191.5731 3362.8342 3532.9804
redmass: 1.1122 11.7741 6.6330 4.1190 4.9216 4.8361 4.9702 13.8536 10.5497 5.4439 6.0935 8.2441 5.5467 6.8053 3.8827 4.8978 4.7906 4.3521 1.2893 3.7454 4.4442 3.9324 6.1205 6.3010 3.4922 1.5857 1.9610 1.8734 1.3751 6.6267 6.4628 1.6106 1.3284 1.6381 2.2276 2.2802 1.5339 1.4880 2.5118 2.5755 2.4857 7.2247 1.2178 3.2093 2.7255 1.0482 1.1083 2.8741 4.2257 7.3443 2.4748 8.2274 1.0359 1.0984 1.1006 1.0893 1.0944 1.0971 1.0795 1.0645
irintensity: 0.9108 6.0244 0.8779 4.5457 0.4884 7.7504 2.0802 0.3543 0.1688 5.2911 1.2469 1.7623 5.0503 9.2350 0.4453 28.4024 3.9677 1.4017 98.1290 6.2035 27.6840 61.2604 4.7117 12.7666 12.1029 52.0676 59.7365 72.4358 3.8448 2.1993 195.2997 34.3890 5.6197 21.5099 24.5053 41.8747 68.9306 80.2094 44.2008 28.7831 162.5088 141.4975 70.4269 53.2945 233.0296 17.2736 24.4497 120.7013 473.3820 200.2720 17.8033 267.0834 8.5835 9.7954 15.1919 8.8986 2.3833 15.7033 199.4327 54.5843
temp: 298.150 k
press: 1.00000 atm
elementType: 17 8 8 8 7 6 6 6 6 6 6 6 6 6 1 1 1 1 1 1 1 1
symmnumber: 1
zpe: 410121.6 jmol-1
zpe.correction: 0.156207 hartree
zpe.thermalcorrener: 0.169526 hartree
zpe.thermalcorrenthalpy: 0.170470 hartree
zpe.thermalcorrgfe: 0.113874 hartree
zpe.sumelectzpe: -1087.254463 hartree
zpe.sumelectthermal: -1087.241145 hartree
zpe.sumelectthermalent: -1087.240200 hartree
zpe.sumelectthermalfe: -1087.296796 hartree
dipole: 1.7272 -1.6116 -0.8563
dipole: 2.5127
quadrupole: -95.5986 -76.0965 -90.2983
quadrupole: -18.5162 0.6277 1.3833
quadrupole: -8.2674 11.2346 -2.9672 -18.5162 0.6277 1.3833
hfenergy: -1087.4106703 hartree
pointgroup: C01 [X(C9H8Cl1N1O3)]
dipole: -0.6713736 -0.6370868 0.3473505 debye
dipolederiv: -0.7175671 0.112971 -0.0661256 0.1872008 -0.0914344 0.0352623 -0.1063598 0.0321428 -0.0432335 -0.7984232 -0.4196708 0.1873971 -0.3525923 -0.7816328 0.1859709 0.1514456 0.2397016 -0.5265349 -0.9266026 0.0208043 -0.0407823 0.5333711 -0.7909146 0.1114567 -0.14709 0.0766561 -0.3790869 -0.7671455 0.2795871 0.16457 0.3673854 -0.8784357 -0.0833312 0.1887584 -0.0436548 -0.3554702 -2.1800691 -0.098688 -0.1001887 -0.2177822 -0.5288374 0.0087984 -0.1444382 0.0166449 -0.304569 1.0627395 0.0495805 0.0169246 0.8885433 0.4636191 0.0183607 -0.0951869 0.0371679 0.1165373 -0.4804663 -0.0488932 0.0083502 0.2960638 -0.862094 0.0440754 -0.0194527 0.0445757 -0.0366677 -0.2971415 -0.0837191 -0.0076836 -0.5807496 -0.3373338 -0.0184673 0.065837 0.0026245 -0.1611366 1.0105907 0.1032841 0.1158573 -0.6224072 0.4929583 -0.0817801 0.1789215 -0.1119288 -0.0279946 0.5318185 -0.0754541 0.0372769 0.1003649 0.2286468 -0.0182996 0.0401696 -0.0371631 -0.1030458 -0.4990378 0.1862075 -0.0349496 0.4532244 -0.3294145 0.039513 -0.046557 0.0254814 -0.1368539 2.2654929 0.0733237 0.138052 -0.5692203 0.9524804 -0.1705621 0.2676807 -0.1267338 0.236607 1.2107922 0.006687 -0.4375296 -0.1462573 1.8667922 -0.0916726 -0.393191 -0.1097609 0.4207265 -0.3026703 -0.2420073 0.0181759 -0.2425594 -0.1681503 0.0048959 -0.0038678 -0.007934 0.0061735 0.1488194 0.0717431 -0.000974 0.0267596 0.1249435 0.004271 -0.0011603 0.0130496 0.1821293 0.2961606 -0.1325562 0.0036526 -0.1718299 0.3503816 0.0017644 0.0472553 -0.0233912 0.3021 0.0809606 0.0200194 -0.0068028 0.0077876 -0.0838138 0.016328 -0.0091789 0.0182466 0.1493264 0.0034393 -0.0713867 -0.0063365 -0.0455955 0.0592104 0.0027691 -0.0245089 0.0093817 0.1697097 0.0771774 -0.0157244 -0.0670631 -0.0346263 0.0843221 0.0092146 -0.0990019 -0.0259126 -0.0351172 0.0247321 0.0175556 0.0875593 0.0267526 0.0722032 -0.049437 0.1256086 -0.0064731 0.0360598 0.0297879 0.1149297 -0.0403234 0.030758 -0.0892448 0.0516829 -0.0155691 0.0606734 0.1000276 0.2266124 0.1314067 0.0309432 0.0654087 0.2457485 -0.0208134 0.0398856 -0.0833939 0.3903133 unknown
polarizability: 191.2659813|0.3605567|147.2099537|4.0009367|-5.4300107|55.9306852 unknown
InChI: InChI=1S/C9H8ClNO3/c1-5(12)11-7-4-2-3-6(10)8(7)9(13)14/h2-4,11,13H,1H3
charge 0 multiplicity 1
22 atoms
Cl 3.782601 0.024401 0.294369
O  0.023334 -2.457044 0.542252
O  -3.257044 1.129408 -0.345893
O  2.177942 -2.345774 -0.266802
N  -1.524484 -0.428007 0.058293
C  -0.364529 0.377492 0.023483
C  0.9483 -0.2414 0.092601
C  -0.478124 1.790779 -0.090798
C  2.079188 0.634215 0.100273
C  0.6708 2.596699 -0.101212
C  1.958492 2.029638 0.010003
C  -2.863603 -0.050668 -0.112524
C  1.161514 -1.714142 0.085103
C  -3.849539 -1.211048 -0.000703
H  -1.476268 2.223279 -0.171111
H  -1.341021 -1.420922 0.267101
H  0.566199 3.683393 -0.184187
H  2.85425 2.654773 0.030843
H  -4.363155 -1.339398 -0.969759
H  -4.62114 -0.952962 0.744225
H  -3.380673 -2.168276 0.283597
H  0.256462 -3.422536 0.503245
