program: Gaussian 09
title: 000088856
version: EM64L-G09RevD.01
frameworkgroup: C1[X(C10H15ClO3S)]
method: RPBEPBE
basis: SDD
operation: Freq
keyword: #p
keyword: freq=noraman
keyword: PBEPBE/SDD
title: #p freq=noraman PBEPBE/SDD
converged: NO YES NO NO
title: Mulliken charges:
elementType: Cl S O O O C C C C C C C C C C H H H H H H H H H H H H H H H
charge: -0.213500 0.910415 -0.149157 -0.484491 -0.476997 0.239376 0.320252 -0.203656 -0.548133 -0.470347 -0.562895 0.086789 -0.787466 -0.762807 -0.784038 0.265092 0.308321 0.248836 0.221554 0.249815 0.280338 0.253868 0.310513 0.324528 0.229008 0.240220 0.225874 0.247313 0.256432 0.224944
chargesum: 0.00000
title: Mulliken charges with hydrogens summed into heavy atoms:
elementType: Cl S O O O C C C C C C C C C C
charge: -0.213500 0.910415 -0.149157 -0.484491 -0.476997 0.239376 0.320252 0.061436 0.009024 0.001022 -0.028689 0.086789 -0.152425 -0.067706 -0.055348
polarizability: 2.29733930e+02 -3.39149535e+00 1.47925949e+02 1.58752869e+00 -1.15611458e+00 1.24898057e+02
1716.lowfreq: -13.9901 -11.1682 -0.0031 -0.0013 0.0011 11.2385 29.9844 60.5270 80.5242
frequency: 29.5350 60.2382 80.4667 97.3796 127.4374 147.5418 167.3325 181.6124 194.1080 211.4911 226.7918 253.0903 270.3591 277.5394 284.0485 355.2864 369.4892 385.2661 400.4977 423.4792 457.5614 499.2783 540.0096 553.4611 576.6427 591.5584 644.5206 706.1890 741.1149 823.9089 824.9730 844.2463 853.3378 885.6284 923.3100 930.5694 939.9096 949.3086 962.1939 995.7198 1010.2106 1028.0126 1035.6513 1059.4808 1099.5116 1116.4857 1168.0388 1184.3021 1197.9372 1204.9872 1210.9093 1228.6433 1243.8071 1250.7971 1261.8224 1293.8141 1301.8041 1313.0157 1391.6742 1407.9130 1414.3844 1432.9635 1464.5473 1475.7615 1482.2169 1490.6220 1494.1872 1507.3843 1662.8878 2981.3354 2988.0207 3003.9619 3015.1812 3024.9770 3049.9184 3061.0505 3068.7550 3071.3730 3073.5083 3076.1239 3080.2103 3087.1187 3101.0073 3135.0202
redmass: 9.5495 4.9570 6.9224 5.6311 5.8445 10.5310 12.0418 1.3555 5.6660 13.7930 2.0112 1.6788 1.6153 2.6097 1.7528 10.2143 2.5973 2.7058 3.3171 3.5170 3.5006 4.9071 4.1282 3.6404 4.4251 3.4207 4.0257 3.2227 2.1747 1.7002 6.2910 2.8502 2.6312 2.4372 2.6170 2.5841 2.0815 1.4751 2.1650 1.4725 2.5249 2.9792 1.8890 1.7171 1.2542 1.5895 2.0143 1.4331 2.1062 1.6473 1.9850 1.4888 1.8030 1.6463 1.5490 1.5942 1.4788 1.7424 1.1929 1.1546 1.1405 1.0851 1.0542 1.0603 1.0551 1.0790 1.0574 1.0596 12.4799 1.0364 1.0385 1.0602 1.0606 1.0626 1.0568 1.1034 1.0994 1.1000 1.0955 1.0933 1.0986 1.1035 1.0984 1.1095
irintensity: 1.5884 1.8187 0.5921 5.5635 2.2223 5.6793 0.6654 0.2283 2.0674 8.8688 0.4406 1.4132 0.9445 0.5424 0.5422 24.3674 0.7140 16.6710 44.2725 43.4173 1.8338 0.0554 4.6377 3.9405 6.2756 10.4700 6.7959 1.1207 34.4416 7.8070 52.2490 30.6827 0.5290 6.3422 9.1851 39.4894 0.7520 11.3768 9.2969 8.2831 32.2808 67.0802 3.9957 7.8915 4.3668 27.7244 22.0505 6.2408 19.1542 37.0054 57.4898 4.5913 23.3075 3.6022 23.8158 7.9231 3.1642 16.6807 16.7252 34.5677 8.1767 15.6776 4.4595 14.4550 1.3216 18.0211 7.7422 14.9155 260.2411 18.4052 18.9485 18.6425 7.4883 32.7296 4.1397 4.5023 6.4721 4.9078 1.4902 58.0556 21.1767 39.0171 13.2005 1.3434
temp: 298.150 k
press: 1.00000 atm
elementType: 17 16 8 8 8 6 6 6 6 6 6 6 6 6 6 1 1 1 1 1 1 1 1 1 1 1 1 1 1 1
symmnumber: 1
zpe: 616302.7 jmol-1
zpe.correction: 0.234737 hartree
zpe.thermalcorrener: 0.250952 hartree
zpe.thermalcorrenthalpy: 0.251896 hartree
zpe.thermalcorrgfe: 0.191127 hartree
zpe.sumelectzpe: -1472.532817 hartree
zpe.sumelectthermal: -1472.516602 hartree
zpe.sumelectthermalent: -1472.515658 hartree
zpe.sumelectthermalfe: -1472.576427 hartree
dipole: 7.3150 -0.5503 -0.0989
dipole: 7.3363
quadrupole: -112.1954 -115.7606 -105.3031
quadrupole: -6.1408 1.1515 1.8733
quadrupole: -1.1091 -4.6742 5.7833 -6.1408 1.1515 1.8733
hfenergy: -1472.7675539 hartree
pointgroup: C01 [X(C10H15Cl1O3S1)]
dipole: 2.7339608 0.9061816 0.1874307 debye
polarizability: 218.36017|28.125312|156.1685375|10.4814396|-3.6715817|128.0292284 unknown
InChI: InChI=1S/C10H15O3S.Cl/c1-9(2)7-3-4-10(9,6-14(12)13)8(11)5-7;/h7H,3-6H2,1-2H3;
charge 0 multiplicity 1
30 atoms
Cl -4.248364 -0.991894 -0.703325
S  -1.987063 -1.650826 -0.029878
O  0.164042 2.479756 -1.241152
O  -1.913634 -1.739368 1.586929
O  -1.534439 -2.935116 -0.909268
C  0.264407 0.221224 -0.094309
C  1.502207 -0.745339 -0.326253
C  2.516185 0.242156 0.372265
C  0.333818 0.524689 1.452697
C  1.86852 0.478554 1.770848
C  2.340618 1.555337 -0.426857
C  0.829576 1.575158 -0.701198
C  -1.083976 -0.03871 -0.70359
C  1.787315 -1.016555 -1.82367
C  1.422375 -2.110011 0.400858
H  3.553077 -0.127845 0.406888
H  -0.231476 -0.249126 2.001506
H  -0.129211 1.497166 1.697052
H  2.228081 1.416681 2.22814
H  2.105906 -0.340354 2.469566
H  2.883853 1.558724 -1.389159
H  2.640181 2.465925 0.122025
H  -1.073042 -0.258602 -1.783469
H  -1.831302 0.737037 -0.473314
H  2.758975 -1.530948 -1.937502
H  1.015008 -1.686515 -2.244717
H  1.814694 -0.10529 -2.447571
H  1.064788 -2.040379 1.440843
H  0.762249 -2.815073 -0.134069
H  2.432132 -2.561656 0.424485
