program: Gaussian 09
title: 000084829
version: EM64L-G09RevD.01
frameworkgroup: C1[X(C7H6N2S)]
method: RPBEPBE
basis: SDD
operation: Freq
keyword: #pfreq=noraman
keyword: PBEPBE/SDD
title: #p freq=noraman PBEPBE/SDD
converged: NO NO NO NO
title: Mulliken charges:
elementType: S N N C C C C C C C H H H H H H
charge: 0.102440 -0.691790 0.307940 0.503974 0.487033 -0.380511 -0.381056 -0.367607 -0.367921 -0.785905 0.225400 0.225398 0.250616 0.250682 0.310675 0.310632
chargesum: 0.00000
title: Mulliken charges with hydrogens summed into heavy atoms:
elementType: S N N C C C C C C C
charge: 0.102440 -0.070483 0.307940 0.503974 0.487033 -0.155111 -0.155658 -0.116990 -0.117239 -0.785905
polarizability: 2.46690812e+02 1.56144699e-01 8.47956618e+01 2.84462104e-01 6.93824236e-03 3.98299051e+01
1716.lowfreq: -9.0098 -5.0117 -0.0020 -0.0017 0.0034 13.6017 27.4196 57.1076 170.2457
frequency: 27.3555 57.1026 170.2454 321.6909 325.7075 347.5336 371.9799 381.7387 392.1687 408.4309 428.4626 447.2659 516.6922 602.9766 639.1364 718.7232 807.2085 811.8711 826.8361 896.9704 941.5231 950.2180 995.2304 1015.9501 1126.6003 1180.8841 1260.2197 1304.3990 1326.1568 1368.3793 1447.2116 1510.9997 1564.5023 1631.4879 1647.9860 2195.5439 3125.4506 3128.2252 3160.5932 3165.0484 3565.5284 3704.2315
redmass: 8.1153 7.3893 6.0058 4.3796 9.9949 4.4610 1.0324 1.3678 5.5774 2.8529 10.1890 5.4576 2.3381 7.3717 6.8723 3.4986 1.2579 5.2860 1.7833 8.5603 1.3740 1.3452 2.6600 1.4409 1.2150 1.1102 2.9977 1.3604 3.8711 4.1860 3.9800 3.1610 6.8546 2.9500 1.4736 12.8804 1.0893 1.0889 1.0955 1.0967 1.0452 1.1039
irintensity: 0.1970 0.6696 1.7495 0.3047 1.2388 27.5090 0.6347 299.1978 1.3418 0.0106 3.5513 2.4001 22.8689 46.9849 0.2795 0.0004 0.0010 0.5760 99.6589 37.5907 0.4996 0.0002 0.6393 0.1473 19.3379 32.6283 0.2526 0.4821 95.0160 4.9110 2.0182 194.4365 0.9649 28.0786 339.7418 1039.7883 9.8683 32.2446 13.6006 0.0022 122.8103 23.5387
temp: 298.150 k
press: 1.00000 atm
elementType: 16 7 7 6 6 6 6 6 6 6 1 1 1 1 1 1
symmnumber: 1
zpe: 303950.0 jmol-1
zpe.correction: 0.115768 hartree
zpe.thermalcorrener: 0.125051 hartree
zpe.thermalcorrenthalpy: 0.125995 hartree
zpe.thermalcorrgfe: 0.080007 hartree
zpe.sumelectzpe: -777.217056 hartree
zpe.sumelectthermal: -777.207773 hartree
zpe.sumelectthermalent: -777.206829 hartree
zpe.sumelectthermalfe: -777.252817 hartree
dipole: 7.0854 -0.0065 -0.0188
dipole: 7.0854
quadrupole: -58.4522 -57.2532 -70.1332
quadrupole: -0.0131 -0.0953 0.0042
quadrupole: 3.4940 4.6930 -8.1870 -0.0131 -0.0953 0.0042
hfenergy: -777.3328241 hartree
pointgroup: C01 [X(C7H6N2S1)]
dipole: 2.7837406 0.0021675 -0.1470614 debye
dipolederiv: -1.5390592 -0.003898 0.0666767 -0.0150781 -0.1017091 0.0006738 0.0170855 0.0000288 -0.1010501 -1.9706341 0.001069 0.0652146 0.0032139 -0.0931891 0.0031367 0.0702451 0.0031497 -0.7494701 -2.1124258 -0.0092127 0.0832467 -0.0024834 -0.1382154 -0.000414 0.0863434 -0.0001372 0.0033005 1.9721676 -0.0011195 -0.0999996 -0.0041036 -0.0485567 -0.0008089 -0.1042445 -0.0009366 0.1577301 0.8687826 0.00268 -0.0370288 0.0006062 -0.0657414 -0.0003177 -0.0504259 -0.0003579 0.024055 -0.52396 -0.0995769 0.0153418 0.5235527 0.0731949 -0.0276248 0.0195273 0.006267 -0.223671 -0.5235224 0.0994134 0.0161634 -0.5212417 0.0733474 0.0295049 0.0148153 -0.0039733 -0.2232073 0.2027444 0.1732078 -0.0191231 0.028493 0.1316131 -0.0008801 -0.0160978 -0.0091572 -0.1272396 0.200349 -0.1735646 -0.0202413 -0.0290146 0.1315637 0.0027018 -0.0159148 0.0107285 -0.1273119 2.8965237 0.0117825 -0.1232392 0.016837 -0.0538892 -0.0006174 -0.0727141 -0.0002563 -0.0838724 -0.0318596 -0.10162 0.0108479 -0.1017649 -0.053609 0.0049341 0.0109069 0.0053831 0.1696934 -0.0316081 0.1013182 0.0115125 0.1017138 -0.0538543 -0.0064212 0.011501 -0.0069095 0.1695456 0.0599991 0.0807193 0.0064674 0.0767787 -0.0215952 -0.0047861 0.0057438 -0.0049712 0.1644317 0.0597263 -0.0807496 0.0059218 -0.0770595 -0.0212933 0.0035271 0.0053754 0.00371 0.1643354 0.236318 -0.0128627 0.0090378 -0.0720883 0.1209068 0.0024722 0.0091738 -0.0005558 0.3912858 0.2364585 0.0124138 0.0092015 0.0716389 0.1210267 -0.0050804 0.0086795 -0.0020122 0.3914449 unknown
polarizability: 246.1989793|0.4362047|84.7960121|-10.0686005|0.1477895|40.3213876 unknown
InChI: InChI=1S/C7H6N2S/c8-6-1-3-7(4-2-6)9-5-10/h1-4H,8H2
charge 0 multiplicity 1
16 atoms
S  -4.761411 -0.014243 0.202823
N  3.699813 -0.001721 -0.218246
N  -1.922059 0.001439 0.098079
C  2.309453 0.000433 -0.138789
C  -0.542021 0.003104 0.021031
C  1.5807 1.227451 -0.093546
C  1.578126 -1.225095 -0.101763
C  0.178718 1.229338 -0.013466
C  0.176417 -1.224227 -0.022095
C  -3.126147 0.001083 0.163366
H  2.121108 2.181265 -0.121926
H  2.116396 -2.179911 -0.136446
H  -0.372109 2.174741 0.020669
H  -0.376514 -2.168604 0.005699
H  4.219864 -0.873649 -0.252562
H  4.223566 0.868199 -0.243826
