program: Gaussian 09
title: 000078306
version: EM64L-G09RevD.01
frameworkgroup: C1[X(C6H10N4O4S2)]
method: RPBEPBE
basis: SDD
operation: Freq
keyword: #p
keyword: freq=noraman
keyword: PBEPBE/SDD
title: #p freq=noraman PBEPBE/SDD
converged: YES YES NO NO
title: Mulliken charges:
elementType: S S O O O O N N N N C C C C C C H H H H H H H H H H
charge: 0.804760 0.806660 -0.637729 -0.626757 -0.643412 -0.621162 -0.142198 -0.143422 -0.406523 -0.406437 -0.180601 -0.180001 -0.211515 -0.204786 -0.219924 -0.190771 0.324940 0.275143 0.296824 0.247024 0.305578 0.303007 0.317452 0.407396 0.318550 0.407902
chargesum: 0.00000
title: Mulliken charges with hydrogens summed into heavy atoms:
elementType: S S O O O O N N N N C C C C C C
charge: 0.804760 0.806660 -0.637729 -0.219361 -0.643412 -0.213260 0.163380 0.159585 -0.089072 -0.087886 -0.180601 -0.180001 0.113426 0.070357 0.076900 0.056253
polarizability: 1.85313726e+02 -2.43756947e+00 1.54558489e+02 2.04184583e+00 -1.49477825e+01 1.32806549e+02
1716.lowfreq: -8.5077 -0.0018 -0.0016 0.0013 3.5831 5.1813 10.2264 20.6081 30.1686
frequency: 9.5055 20.5121 30.1585 39.1145 89.8797 110.9768 125.6426 135.6238 149.8890 179.5165 203.9434 221.1445 224.9083 231.7839 246.1844 252.2145 291.5641 339.3328 348.3418 351.5361 375.6238 382.4347 390.3694 414.3770 461.4120 504.7307 510.0268 555.0919 620.3597 623.4679 631.1902 690.6338 692.3725 769.7931 773.0793 801.9770 918.0969 933.7447 971.9141 995.5323 1042.0276 1054.6187 1087.9659 1092.6936 1094.8990 1170.4748 1264.5788 1302.3599 1302.8899 1317.8607 1319.3781 1385.2297 1398.0877 1433.4901 1478.7354 1480.6141 1557.6615 1558.4414 1569.7238 1584.7296 1607.7706 1609.6418 1911.3349 1927.9402 2611.5047 2626.4833 3136.7984 3140.1229 3151.8844 3167.9286 3239.5870 3240.7790
redmass: 8.0939 7.2474 8.1260 6.1505 7.3690 6.0356 4.7724 6.2214 6.1230 8.8698 9.8066 9.5340 10.1460 7.0093 6.6005 6.1690 9.5571 6.2302 10.0505 8.0034 3.8843 4.3121 7.7404 5.0202 3.8653 1.1906 1.2491 6.3841 10.7082 12.8056 8.1565 2.7358 7.2043 17.2995 15.1608 1.3840 1.3584 1.3481 6.5180 1.3584 6.6562 1.6864 1.5586 1.0938 1.0948 1.0916 1.2751 1.1215 1.1220 1.0687 1.0665 9.3056 2.6191 2.0963 2.9646 2.9415 1.4258 1.4263 6.4269 7.1922 1.2030 1.2051 1.0824 1.0812 1.0797 1.0796 1.0918 1.0870 1.0918 1.0993 1.0755 1.0755
irintensity: 0.3710 0.1730 3.1952 1.3160 3.5134 0.3366 4.3071 2.0927 15.9463 0.8641 1.6458 1.1329 19.6147 9.7299 6.6822 4.7830 3.4409 31.3304 1.0963 1.0709 33.7565 63.9476 33.0088 22.5336 20.1033 14.8767 10.2597 32.2441 23.9566 29.9754 17.3632 41.2920 10.4301 54.0672 45.5006 43.8261 11.0827 0.3889 3.4024 2.6841 1.9819 30.4370 17.3235 237.6644 82.6356 3.9593 6.0023 95.5892 48.3295 207.9400 85.8704 3.3653 20.8770 14.6330 51.5108 71.7400 17.5763 36.7241 10.4885 4.4196 28.7498 37.0891 423.0349 2293.6362 302.7174 408.5283 10.5188 4.1860 3.5666 10.2364 5.6623 6.2318
temp: 298.150 k
press: 1.00000 atm
elementType: 16 16 8 8 8 8 7 7 7 7 6 6 6 6 6 6 1 1 1 1 1 1 1 1 1 1
symmnumber: 1
zpe: 445526.6 jmol-1
zpe.correction: 0.169692 hartree
zpe.thermalcorrener: 0.188284 hartree
zpe.thermalcorrenthalpy: 0.189228 hartree
zpe.thermalcorrgfe: 0.119602 hartree
zpe.sumelectzpe: -1549.150537 hartree
zpe.sumelectthermal: -1549.131945 hartree
zpe.sumelectthermalent: -1549.131001 hartree
zpe.sumelectthermalfe: -1549.200627 hartree
dipole: -0.7874 0.2680 3.9465
dipole: 4.0332
quadrupole: -127.5639 -95.8049 -108.9181
quadrupole: 1.2706 -4.9359 8.4169
quadrupole: -16.8016 14.9574 1.8442 1.2706 -4.9359 8.4169
hfenergy: -1549.320229 hartree
pointgroup: C01 [X(C6H10N4O4S2)]
dipole: -0.3301056 0.1192701 -1.5474914 debye
dipolederiv: 1.0522368 0.1876738 -0.0129379 0.3522741 0.5034487 -0.1678022 -0.0467266 -0.1085679 0.8868428 1.1169023 -0.0009601 0.2284526 -0.0916529 0.8489173 -0.1091071 0.1580781 -0.09727 0.4647567 -0.5195822 -0.0038901 -0.0075757 -0.3033623 -0.6810041 0.227608 0.1055476 -0.0492312 -0.5886191 -0.7042586 0.0344832 0.0768807 -0.3497009 -0.7931574 -0.3197469 -0.3498148 -0.1877307 -0.7490385 -0.8870293 -0.041457 -0.0952901 0.0440551 -0.5276522 -0.0838861 0.3154361 0.005767 -0.4904075 -0.6124069 0.0982004 -0.0108774 0.28026 -0.8902226 0.0116536 0.1172357 -0.4298482 -0.6699269 -0.1666021 0.0360198 0.0617327 -0.1169002 -0.3980035 -0.1203317 0.01854 0.0319569 -0.064197 -0.2545251 0.1609986 0.087829 0.0598478 -0.1055226 0.0271348 0.1227137 -0.15221 -0.297536 -0.2144619 -0.0250501 0.016129 -0.0145545 -0.155832 0.1326212 0.0125838 -0.0199893 -0.0388355 -0.1980203 -0.0012837 -0.0322178 0.1183195 -0.0704596 0.0167099 0.0460514 0.1087062 -0.1393288 -0.0552333 0.0693867 -0.0191675 0.055546 -0.0875367 -0.0701911 0.1122674 -0.0272698 -0.1318061 0.0096567 -0.0802834 0.0479844 -0.0377086 -0.0724401 -0.0861538 -0.0895477 -0.0328851 -0.1415187 -0.2711161 -0.015387 -0.0062902 -0.0327172 -0.1415707 -0.0038009 -0.0310995 0.1368133 -0.0957984 -0.1495535 -0.1619247 0.1037528 0.0744934 -0.0545406 -0.0272531 -0.0249056 -0.0503539 -0.0396368 -0.2076263 0.1449882 -0.0809427 -0.0442384 -0.0981466 -0.0076304 0.0343537 -0.0216993 -0.0635043 -0.0732096 0.0091236 -0.0164572 0.0125886 -0.0056487 -0.1399912 -0.0151421 -0.1321403 0.0233193 0.2046572 0.0111631 0.004498 0.0302159 0.1094542 0.0468077 -0.0019789 0.0208084 0.1378346 0.0327897 0.0620073 -0.0458093 0.0156247 0.1450093 0.0321186 -0.0438881 0.0304845 0.1102298 0.0694718 -0.0664841 0.0322463 -0.019334 0.167583 0.0189569 0.0255582 0.0160546 0.120008 0.0318579 -0.0170646 0.0078171 -0.0057385 0.021216 0.1162549 0.0011055 0.1392549 0.0361143 0.2579289 0.0400611 -0.0148308 0.1646348 0.4867183 0.0427525 0.0520608 0.144146 0.2389909 0.3445592 -0.0715362 -0.0373985 -0.1884245 0.3187344 0.1087028 -0.1914769 0.1223499 0.3424061 0.2650314 0.0425891 0.0031314 -0.0334889 0.0237553 -0.1777629 -0.0480313 -0.1572612 0.0218719 0.2477624 -0.1108647 -0.1774627 0.3389639 1.0342972 0.4366465 0.0439829 0.313291 0.2980764 0.2243157 -0.0165543 0.0284961 -0.0020128 0.0253978 -0.1469868 0.0732317 -0.2105815 0.0578861 0.4564552 -0.2839549 -0.1416924 -0.3069901 0.3972057 0.2426765 -0.396135 0.6074056 0.7718168 unknown
polarizability: 185.0716117|3.4818242|158.7252312|-1.8727645|-11.1167996|128.8819211 unknown
InChI: InChI=1S/C6H6O4S2.2H2N2/c7-11(8)5-2-1-3-6(4-5)12(9)10;2*1-2/h1-4,7,9H;2*1-2H
charge 0 multiplicity 1
26 atoms
S  -3.003978 0.49967 1.593317
S  2.68307 0.340741 2.02676
O  -2.610871 -0.986701 2.257851
O  -3.728917 0.201345 -0.016704
O  3.82869 0.727563 0.865161
O  2.323919 -1.404199 1.872866
N  -2.579909 -2.941125 0.331834
N  3.990696 -1.238039 -1.03759
N  -3.039335 -2.204238 -0.609802
N  3.197349 -2.05672 -0.454006
C  -1.287468 1.107095 1.020424
C  1.096955 1.024769 1.212588
C  -0.156196 0.545188 1.638478
C  -1.203117 2.099873 0.02435
C  1.23953 2.017704 0.226531
C  0.075739 2.550992 -0.377222
H  -0.266435 -0.259965 2.375009
H  -2.110818 2.487773 -0.449392
H  2.244374 2.337914 -0.071352
H  0.165548 3.314188 -1.15713
H  -2.530966 -2.314492 1.224145
H  4.065954 -0.361732 -0.389618
H  -3.118708 -2.722927 -1.513773
H  -3.428229 -0.799588 -0.375047
H  3.057478 -2.933898 -1.004832
H  2.613142 -1.755294 0.865854
