program: Gaussian 09
title: 000011081
version: EM64L-G09RevD.01
frameworkgroup: C1[X(C20H34O5)]
method: RPBEPBE
basis: SDD
operation: Freq
keyword: #pfreq=noraman
keyword: PBEPBE/SDD
title: #p freq=noraman PBEPBE/SDD
converged: YES YES NO NO
title: Mulliken charges:
elementType: O O O O O C C C C C C C C C C C C C C C C C C C C H H H H H H H H H H H H H H H H H H H H H H H H H H H H H H H H H H
charge: -0.466188 -0.469203 -0.444365 -0.427779 -0.243292 -0.097241 -0.193190 -0.129884 -0.174576 -0.536851 -0.509285 -0.263281 -0.188448 -0.264907 -0.152928 -0.169960 -0.408085 -0.370338 -0.486421 -0.341322 -0.383582 -0.356662 -0.499267 -0.694824 0.201395 0.224266 0.261773 0.274473 0.237077 0.208488 0.251823 0.219012 0.203312 0.250272 0.347572 0.348754 0.223183 0.263400 0.184387 0.225226 0.209305 0.222614 0.184249 0.204066 0.202920 0.231561 0.190415 0.188012 0.335921 0.204260 0.223386 0.196218 0.193444 0.311357 0.245335 0.209394 0.210707 0.215626 0.368676
chargesum: 0.00000
title: Mulliken charges with hydrogens summed into heavy atoms:
elementType: O O O O O C C C C C C C C C C C C C C C C C C C C
charge: -0.118616 -0.120449 -0.108444 -0.059103 -0.243292 0.127025 0.068584 0.144589 0.062501 -0.076540 -0.086961 -0.013009 0.034735 -0.001507 0.031459 0.055266 0.023834 0.017977 -0.051940 0.037105 0.044065 0.033000 0.057425 -0.059098 0.201395
polarizability: 2.71976154e+02 -1.03830725e+01 2.42166855e+02 6.25182676e+00 -7.40201452e+00 1.93077387e+02
1716.lowfreq: -7.5272 -4.4867 -0.0008 -0.0005 -0.0005 1.7899 6.6248 15.4169 18.7499
frequency: 5.1788 14.7485 18.4496 30.4798 31.4511 38.8867 46.8303 54.1276 58.9837 67.9560 75.3114 98.1177 109.0888 114.6552 129.5033 135.0151 161.0664 164.6753 197.6677 202.2433 222.5294 229.7039 235.2985 256.0822 258.9230 275.6639 288.2806 303.8818 324.8142 331.7668 341.5456 358.6750 374.0060 404.0551 415.2387 439.2726 453.0924 461.2059 475.9112 501.1249 504.5990 521.0965 539.8737 583.4348 589.4171 637.2491 646.7554 679.6304 727.2062 746.6479 752.6952 757.3703 789.4013 816.6885 818.9872 831.1495 834.8213 857.7394 869.2349 886.6047 888.9461 908.5604 928.3742 937.2727 942.1911 948.8973 970.3687 974.4784 984.4493 994.6950 999.5342 1013.9668 1017.3846 1022.9827 1032.4686 1036.1292 1052.9645 1064.3224 1074.0979 1080.4168 1085.6416 1096.2481 1101.3329 1109.9643 1120.4557 1139.1945 1145.6575 1166.4452 1176.6626 1183.0545 1192.5619 1206.3993 1209.8918 1211.8802 1220.0555 1229.7508 1249.0328 1250.9047 1253.5061 1256.6774 1263.4396 1276.0134 1281.4908 1285.0398 1287.9117 1290.9772 1296.7260 1297.5318 1300.4750 1302.1419 1306.8715 1322.4397 1328.1184 1331.0865 1342.1362 1348.9752 1349.5797 1355.8766 1359.9398 1375.6175 1377.2283 1389.0883 1418.4014 1442.5068 1443.3441 1452.3102 1458.1727 1463.5907 1464.3930 1468.6366 1471.7535 1476.6387 1481.4543 1488.6346 1665.7223 1669.6487 1685.7159 2933.7701 2949.4211 2952.6671 2955.0829 2957.3308 2967.3803 2971.1759 2972.1163 2985.2158 2985.4590 2989.5453 2991.9053 2998.7085 3006.0681 3012.7626 3015.4318 3029.4146 3035.8703 3038.1750 3051.0734 3051.7685 3052.0441 3059.3559 3064.9308 3066.0053 3068.5079 3071.3274 3076.2816 3078.1312 3088.1017 3402.2216 3502.3601 3550.4508 3555.9674
redmass: 4.7444 4.3288 5.4826 7.5123 6.1598 6.3887 1.7500 3.8981 3.9702 4.6178 3.2261 3.1875 3.4667 3.5293 2.0163 2.5159 3.7038 3.0005 4.1083 3.9367 2.7031 1.1143 4.1814 3.1845 2.4064 3.1897 4.1681 3.3978 1.2575 2.0406 1.1835 2.5195 3.4311 2.6642 2.6085 2.6900 2.8160 3.2688 3.2171 2.7447 1.9526 3.4285 2.9893 3.0746 3.4005 1.1328 1.3747 3.2695 1.0691 2.0796 2.2897 1.3864 2.4906 2.5417 2.4361 1.3638 2.4815 2.0366 2.5443 1.9263 2.7340 2.4194 2.2526 1.8662 4.0911 1.9262 1.1634 1.9036 1.1205 1.7136 2.2228 2.9043 2.8038 1.9939 2.6845 2.0415 2.0504 1.9862 2.3471 2.0982 1.8930 2.2498 1.8068 2.2221 2.5669 1.5444 1.6877 1.4934 1.2822 1.3344 1.5027 1.3094 1.2285 1.5392 1.3435 1.2941 1.2549 1.5041 1.3680 1.2749 1.2776 1.3102 1.2355 1.0656 1.3478 1.2157 1.2627 1.3686 1.3203 1.4216 1.3383 1.3736 1.3310 1.3688 1.3934 1.4488 1.4426 1.6083 1.5195 1.6402 1.6131 1.2175 1.1581 1.0970 1.0975 1.0965 1.0848 1.0758 1.0687 1.0965 1.0727 1.0427 1.0753 1.0904 7.7346 6.7033 6.6014 1.0838 1.0796 1.0595 1.0666 1.0592 1.0593 1.0628 1.0363 1.0630 1.0595 1.0972 1.0656 1.0635 1.1012 1.0844 1.0854 1.1040 1.0936 1.0963 1.1002 1.0933 1.0982 1.0935 1.0975 1.1010 1.1006 1.0993 1.0899 1.0897 1.0898 1.0658 1.0637 1.0660 1.0659
irintensity: 0.0877 0.2955 0.1038 0.5349 0.6477 0.2378 0.0706 0.9297 0.6581 2.3527 0.6691 0.2678 0.9354 1.8270 0.3419 0.1166 1.2938 0.6882 2.4421 5.6206 1.2791 0.0089 1.4292 0.5859 6.3106 5.3237 2.7695 12.9188 132.4443 7.2302 107.0293 9.1622 34.1735 4.7447 11.5185 4.5777 8.9695 13.6396 11.7086 3.7575 33.1931 4.4539 8.5342 9.9051 7.9167 89.3447 150.9861 16.8023 10.4150 4.2418 7.4691 1.0728 2.3510 20.1485 9.9449 2.9408 10.0049 10.0842 3.9300 5.5682 12.0484 6.0578 32.4845 27.8769 62.4261 15.7995 37.0949 24.2289 59.0821 17.3201 20.6539 2.9695 19.5149 11.1053 167.3613 18.7343 27.8372 19.9794 17.2595 8.1987 31.2806 29.2186 11.2614 6.8361 5.5167 7.3198 28.7350 1.4620 1.8311 13.0010 1.0811 12.3467 23.9180 8.6775 9.5540 10.9715 21.0276 1.5988 6.5398 9.4770 6.3000 3.4305 0.0801 1.6789 6.4871 2.9702 7.9487 5.9771 18.0752 1.0092 7.7002 1.5673 3.5526 12.6614 1.4055 8.7977 6.3558 2.5155 5.4949 26.4982 19.0948 12.5648 48.0340 23.2001 33.4019 6.4191 13.9445 1.8958 0.1203 15.4239 0.8271 12.0948 2.5179 18.9354 195.0698 11.0939 1.1274 38.2773 17.2367 2.1099 35.7850 14.6545 87.3932 31.5373 39.1601 18.6505 53.8777 2.4399 15.2688 49.1966 0.6671 60.1199 7.0361 31.6647 14.5092 11.8854 29.1240 53.3276 22.2061 17.2301 6.6038 30.7910 94.4623 48.4069 31.1734 41.5982 20.5274 86.6371 14.7033 5.7074 4.8490
temp: 298.150 k
press: 1.00000 atm
elementType: 8 8 8 8 8 6 6 6 6 6 6 6 6 6 6 6 6 6 6 6 6 6 6 6 6 1 1 1 1 1 1 1 1 1 1 1 1 1 1 1 1 1 1 1 1 1 1 1 1 1 1 1 1 1 1 1 1 1 1
symmnumber: 1
zpe: 1331919.7 jmol-1
zpe.correction: 0.507301 hartree
zpe.thermalcorrener: 0.536655 hartree
zpe.thermalcorrenthalpy: 0.537599 hartree
zpe.thermalcorrgfe: 0.441353 hartree
zpe.sumelectzpe: -1156.606309 hartree
zpe.sumelectthermal: -1156.576956 hartree
zpe.sumelectthermalent: -1156.576012 hartree
zpe.sumelectthermalfe: -1156.672258 hartree
dipole: -0.5502 -3.2854 2.1068
dipole: 3.9415
quadrupole: -175.9587 -145.8267 -146.9299
quadrupole: 12.2584 5.0344 -9.0591
quadrupole: -19.7203 10.4117 9.3085 12.2584 5.0344 -9.0591
hfenergy: -1157.1136109 hartree
pointgroup: C01 [X(C20H34O5)]
dipole: 0.125349 1.3534803 0.7463821 debye
polarizability: 273.1134168|-7.9508473|241.2498549|-8.6679052|4.1868602|192.8571243 unknown
InChI: InChI=1S/C20H34O5/c1-2-3-6-9-15(21)12-13-17-16(18(22)14-19(17)23)10-7-4-5-8-11-20(24)25/h4,7,12-13,15-19,21-24H,2-3,5-6,8-11,14H2,1H3
charge 0 multiplicity 1
59 atoms
O  2.358047 2.151482 -1.08334
O  0.272352 4.076485 -1.222452
O  -5.59274 1.93809 0.1024
O  4.486412 0.186512 2.001162
O  5.104142 -2.019854 1.658209
C  0.354546 0.974313 -0.085702
C  -0.765231 2.052337 -0.364875
C  1.658923 1.793666 0.161812
C  -0.133088 3.416722 0.059648
C  1.12428 3.053191 0.884277
C  0.450149 -0.102955 -1.193188
C  -2.05483 1.728428 0.352267
C  1.501795 -1.150783 -0.893667
C  -3.223403 1.388869 -0.254054
C  -4.489794 1.014703 0.481934
C  2.590614 -1.386295 -1.670785
C  -5.008481 -0.39342 0.135934
C  -4.095325 -1.52982 0.644458
C  3.715961 -2.34316 -1.340831
C  -4.625133 -2.933047 0.273204
C  5.089397 -1.613873 -1.254193
C  -3.72156 -4.079067 0.782637
C  5.098423 -0.436321 -0.255122
C  -4.251205 -5.478634 0.402424
C  4.909485 -0.880078 1.179993
H  0.115853 0.465751 0.873934
H  -0.962252 2.113626 -1.451743
H  2.399139 1.231854 0.75261
H  -0.847056 4.073976 0.591895
H  0.829899 2.796511 1.920945
H  1.870746 3.866143 0.929871
H  0.686742 0.390586 -2.154188
H  -0.551408 -0.572777 -1.297262
H  -2.011787 1.726236 1.455263
H  1.798253 2.843251 -1.539191
H  0.622614 4.982096 -1.022976
H  1.376052 -1.724882 0.039836
H  -3.293653 1.378371 -1.352755
H  -4.309151 1.082019 1.578762
H  2.712345 -0.791817 -2.590622
H  -5.132001 -0.463346 -0.962952
H  -6.019119 -0.494118 0.577908
H  -3.994894 -1.459354 1.748287
H  -3.0741 -1.403118 0.229837
H  3.798284 -3.127739 -2.120791
H  3.512252 -2.86066 -0.384665
H  -4.723243 -3.008132 -0.830039
H  -5.64797 -3.062968 0.68486
H  -5.255037 2.867849 0.173688
H  5.35412 -1.214354 -2.252644
H  5.868217 -2.347526 -0.974387
H  -2.699249 -3.945673 0.373159
H  -3.626592 -4.005069 1.885505
H  4.326815 0.312301 -0.508836
H  6.070689 0.095815 -0.300398
H  -5.260706 -5.648285 0.822668
H  -4.323369 -5.589644 -0.696061
H  -3.588967 -6.279466 0.779821
H  4.427299 -0.142246 2.940105
