program: Gaussian 09
title: 000065862
version: EM64L-G09RevD.01
frameworkgroup: C1[X(C25H24N2O6)]
method: RPBEPBE
basis: SDD
operation: Freq
keyword: #p
keyword: freq=noraman
keyword: PBEPBE/SDD
title: #p freq=noraman PBEPBE/SDD
converged: NO YES NO NO
title: Mulliken charges:
elementType: O O O O O O N N C C C C C C C C C C C C C C C C C C C C C C C C C H H H H H H H H H H H H H H H H H H H H H H H H
charge: -0.289698 -0.283958 -0.280650 -0.273110 -0.208816 -0.225304 -0.422130 0.020326 -0.393258 0.111618 0.101916 0.507104 0.212199 0.210088 -0.531195 0.164882 -0.379390 -0.807124 -0.765376 0.091884 0.390364 -0.205524 -0.393157 -0.397031 -0.498407 -0.151664 -0.322866 0.484680 -0.400384 -0.397531 -0.244506 -0.239983 -0.243787 0.318528 0.299718 0.330156 0.242613 0.247042 0.313864 0.215143 0.266607 0.192047 0.278153 0.233519 0.284929 0.241336 0.213422 0.238934 0.234862 0.237988 0.268789 0.215386 0.267152 0.224203 0.242555 0.224342 0.228499
chargesum: 0.00000
title: Mulliken charges with hydrogens summed into heavy atoms:
elementType: O O O O O O N N C C C C C C C C C C C C C C C C C C C C C C C C C
charge: -0.289698 -0.283958 -0.280650 -0.273110 -0.208816 -0.225304 -0.122412 0.020326 -0.074730 0.111618 0.101916 0.507104 0.212199 0.210088 -0.201039 0.164882 -0.136776 -0.031075 -0.028569 0.091884 0.390364 0.027995 -0.108228 0.057728 0.213377 0.117125 -0.107480 0.484680 -0.133232 -0.173328 -0.001951 -0.015641 -0.015288
polarizability: 4.43251762e+02 2.74018098e+01 3.09298222e+02 -2.32131912e+00 1.00900360e+01 2.37604743e+02
1716.lowfreq: -46.4173 -6.6906 -3.1249 -0.0007 -0.0003 0.0004 6.2377 10.5873 14.9394
frequency: -46.3224 10.0538 14.4251 26.7266 32.0633 42.8520 46.0380 47.3710 59.2566 65.9236 74.2218 76.7438 82.7810 89.1260 92.3098 107.2810 123.0837 127.6009 149.8722 158.5671 169.3730 182.6867 199.0359 211.6800 224.2532 258.5164 284.6964 290.1055 305.2943 317.3233 320.6874 346.8871 355.4698 368.5135 371.9662 388.3815 400.2624 404.6966 426.2471 440.3933 469.4821 503.3051 518.3974 528.5671 555.1945 571.5659 580.7848 588.0224 608.9164 611.2352 614.9727 645.0571 655.5641 665.2031 686.8644 700.0019 702.6298 714.0556 731.5426 743.3460 750.1288 764.0881 776.4913 788.2401 818.2982 822.7791 833.6019 855.5901 880.5796 888.0692 906.8855 931.7214 941.6399 964.3992 967.2602 969.5245 982.4361 985.7347 989.0876 989.6062 996.0677 998.5421 1008.3243 1025.8450 1027.4404 1036.0539 1043.1207 1048.6579 1080.9212 1083.9966 1093.5813 1101.0807 1113.8508 1114.8977 1142.2243 1148.8197 1172.3767 1174.5007 1185.9569 1193.4607 1206.5534 1221.2724 1223.1919 1227.2080 1247.6608 1273.1113 1293.3716 1299.3347 1303.6222 1305.8708 1316.9276 1331.2901 1337.7968 1350.0006 1362.8249 1386.7754 1396.7184 1399.4191 1407.7938 1423.1816 1432.9971 1437.3140 1439.1423 1445.7005 1446.6758 1450.8623 1463.0871 1465.8501 1472.0024 1473.1582 1482.4061 1485.0177 1561.6031 1583.4847 1585.1465 1589.8248 1610.2139 1610.7095 1636.1811 1655.7077 1662.0786 2975.7525 2985.2898 3001.1466 3028.2572 3047.2719 3057.4186 3065.6607 3071.0817 3100.9959 3106.9800 3113.5259 3120.4855 3129.3712 3136.9767 3138.3345 3142.3673 3145.5969 3152.3131 3154.6570 3157.6265 3166.2711 3171.9119 3187.2261 3541.8620
redmass: 1.1857 5.7791 5.4454 5.2125 8.2364 3.7884 3.0477 3.2368 1.4293 2.2899 7.1911 3.9091 2.9291 2.8639 3.8034 4.0426 3.4962 4.9973 4.7369 4.6995 5.3156 3.6768 3.9429 3.8736 5.5510 3.8863 3.9574 5.4483 4.4745 5.0869 3.1785 6.7535 3.9972 4.9770 3.4943 5.5065 7.0362 2.8152 3.3749 6.2365 3.3000 5.3340 6.4791 3.9946 4.0459 3.7361 4.0514 4.4665 3.6069 1.9762 6.3210 3.5350 6.1204 6.2689 3.1202 2.0748 2.8479 8.1042 7.4807 5.0303 5.0371 2.2362 4.0707 4.1588 3.7848 2.0162 3.0167 1.3461 4.2395 2.3569 6.1239 1.4847 1.5255 1.7594 1.8145 1.4693 1.3859 1.9798 6.2171 2.6361 3.0860 1.3630 1.3141 2.1334 1.5889 1.5495 6.3449 1.5619 1.8403 1.6612 2.0673 3.6046 1.2659 2.5727 1.9849 2.3167 1.0678 1.1540 3.5137 1.1569 2.0189 2.5711 1.7495 1.9101 3.5988 1.5155 1.3143 2.0301 2.0516 1.5786 2.6658 1.9411 1.3084 1.5510 9.7108 5.7762 2.7710 1.4650 1.2168 1.2092 2.3642 1.2437 1.9868 1.1977 1.2147 1.0505 1.0575 1.1048 1.6137 2.5541 1.0540 2.2821 8.7447 5.6523 6.4452 8.0926 6.3665 6.4994 4.2627 8.1264 5.9363 1.0413 1.0402 1.0296 1.0585 1.0974 1.0833 1.0979 1.0899 1.1042 1.1051 1.0872 1.0956 1.0874 1.0922 1.0870 1.0909 1.1044 1.0955 1.0942 1.0940 1.1011 1.0925 1.0960 1.0772
irintensity: 0.4573 0.2646 0.3835 0.0339 1.0069 1.5380 1.4663 0.9993 0.1624 0.5826 1.8660 0.5531 0.3310 0.8002 3.8433 0.5052 0.1811 1.5632 6.2828 0.5988 2.3904 1.4622 4.8343 1.3099 3.8419 6.7691 5.2847 0.4401 4.1348 6.9102 4.3235 5.4799 2.8410 9.1997 4.0620 2.3116 4.7326 0.1807 1.0731 11.9959 10.2588 1.1175 2.2228 5.8468 3.4312 6.7079 10.7647 2.0353 4.4248 37.0181 0.7043 17.4935 7.0940 3.9629 10.0965 37.6794 38.4544 32.4545 0.0736 10.9893 3.0807 29.5885 40.8166 10.6497 32.1204 19.4207 75.2430 6.2707 9.3672 52.7809 5.3078 0.6791 0.2785 8.2688 24.4148 13.6772 14.2226 172.5401 0.7120 43.6131 226.3986 2.9503 13.7494 6.9284 4.3748 9.8260 96.2721 14.8060 13.3872 59.1148 29.9895 151.1466 0.2546 23.5979 26.3163 85.3520 2.5516 19.3736 12.6219 15.2979 465.1701 289.4312 72.9692 4.9417 48.8850 1.6029 4.3960 77.2570 42.4732 5.7507 66.2837 11.9183 2.3615 24.2027 120.1402 1.9978 35.8349 20.4066 57.7196 31.6447 18.3727 114.5743 12.0052 83.2999 29.0805 12.8451 11.9850 18.4872 238.9713 46.5866 20.6163 10.5332 100.6853 2.5246 12.4006 342.6576 2.2561 3.8216 16.5505 247.6269 21.2841 31.1609 28.9013 46.2221 37.1843 14.5917 1.3273 16.8114 20.4882 25.6943 7.7031 8.6836 3.9197 2.2114 20.5088 4.8209 13.4186 12.9927 25.8249 1.8616 11.9651 21.6937 12.5827 3.8916 44.0768
temp: 298.150 k
press: 1.00000 atm
elementType: 8 8 8 8 8 8 7 7 6 6 6 6 6 6 6 6 6 6 6 6 6 6 6 6 6 6 6 6 6 6 6 6 6 1 1 1 1 1 1 1 1 1 1 1 1 1 1 1 1 1 1 1 1 1 1 1 1
symmnumber: 1
zpe: 1153707.5 jmol-1
zpe.correction: 0.439424 hartree
zpe.thermalcorrener: 0.470586 hartree
zpe.thermalcorrenthalpy: 0.471530 hartree
zpe.thermalcorrgfe: 0.372581 hartree
zpe.sumelectzpe: -1525.456393 hartree
zpe.sumelectthermal: -1525.425231 hartree
zpe.sumelectthermalent: -1525.424286 hartree
zpe.sumelectthermalfe: -1525.523236 hartree
dipole: -3.7734 -4.6182 -4.8377
dipole: 7.6791
quadrupole: -189.6210 -176.7807 -182.5027
quadrupole: -6.6022 4.2422 7.2975
quadrupole: -6.6529 6.1874 0.4655 -6.6022 4.2422 7.2975
hfenergy: -1525.8958169 hartree
pointgroup: C01 [X(C25H24N2O6)]
dipole: 1.8510902 1.4959608 -1.8609846 debye
polarizability: 448.3245195|2.4955141|303.6418082|7.762342|-11.1745763|238.1883983 unknown
InChI: InChI=1S/C25H24N2O6/c1-16-21(24(28)32-3)23(19-12-7-13-20(15-19)27(30)31)22(17(2)26-16)25(29)33-14-8-11-18-9-5-4-6-10-18/h4-13,15,23,26H,14H2,1-3H3
charge 0 multiplicity 1
57 atoms
O  0.061592 2.800869 0.625184
O  3.945707 -1.958116 1.964368
O  0.398179 1.050058 2.11659
O  5.942771 -1.499256 0.849723
O  -2.710907 -3.57344 -0.475289
O  -2.416083 -1.964564 1.108806
N  3.6052 1.369195 -1.413602
N  -1.990117 -2.681538 0.119008
C  2.383643 -0.212742 0.560008
C  1.855704 1.195126 0.204877
C  3.870576 -0.334673 0.238739
C  1.517957 -1.274957 -0.161097
C  2.422008 1.885707 -0.849746
C  4.410394 0.396387 -0.805721
C  0.213233 -1.54281 0.322918
C  0.74351 1.655943 1.060366
C  1.961451 -1.961896 -1.319856
C  1.990569 3.196194 -1.469908
C  5.818823 0.307585 -1.34872
C  4.7065 -1.278521 0.995314
C  -0.60892 -2.453202 -0.370228
C  1.12756 -2.889834 -1.988069
C  -0.176496 -3.145319 -1.523621
C  -1.162646 3.164036 1.450053
C  4.698457 -2.915933 2.802604
C  -2.316875 2.258743 1.131379
C  -3.422177 2.672181 0.445778
C  -4.598881 1.857109 0.083385
C  -4.683577 0.457881 0.343731
C  -5.695284 2.489735 -0.568844
C  -5.824727 -0.274585 -0.038154
C  -6.840339 1.756714 -0.946785
C  -6.909741 0.369288 -0.682931
H  2.233241 -0.357767 1.642167
H  3.99788 1.872188 -2.211129
H  -0.159987 -1.046212 1.222817
H  2.973766 -1.779037 -1.695316
H  2.622869 4.028747 -1.104972
H  0.949096 3.424185 -1.217752
H  2.096981 3.150075 -2.571248
H  6.535637 0.790316 -0.659064
H  5.892868 0.808098 -2.332564
H  6.155111 -0.735647 -1.433712
H  1.496508 -3.411451 -2.877446
H  -0.849445 -3.846869 -2.022722
H  -0.868262 3.095727 2.512131
H  -1.353617 4.210026 1.161621
H  5.507003 -2.398335 3.34633
H  3.951693 -3.325626 3.49727
H  5.138227 -3.711119 2.17714
H  -2.224108 1.22626 1.488615
H  -3.463916 3.724919 0.122517
H  -3.859364 -0.070271 0.834724
H  -5.64451 3.566177 -0.777838
H  -5.8646 -1.35038 0.164421
H  -7.673698 2.263734 -1.4462
H  -7.794934 -0.205302 -0.977952
