program: Gaussian 09
title: 000049744
version: EM64L-G09RevD.01
frameworkgroup: C1[X(C20H21NO3)]
method: RPBEPBE
basis: SDD
operation: Freq
keyword: #p
keyword: freq=noraman
keyword: PBEPBE/SDD
title: #p freq=noraman PBEPBE/SDD
converged: YES YES NO NO
title: Mulliken charges:
elementType: O O O N C C C C C C C C C C C C C C C C C C C C H H H H H H H H H H H H H H H H H H H H H
charge: -0.315847 -0.414899 -0.256921 -0.272133 -0.477047 0.154661 0.020450 -0.309975 -0.308171 0.237962 0.121788 -0.390148 -0.373820 -0.681005 -0.671338 0.102214 0.281504 -0.436395 0.317778 -0.373007 -0.368155 -0.238378 -0.225528 -0.238432 0.244355 0.252089 0.213747 0.246234 0.210741 0.217089 0.280412 0.253519 0.247314 0.207924 0.225939 0.237765 0.218814 0.222001 0.249030 0.404195 0.234943 0.254521 0.232340 0.228155 0.233716
chargesum: 0.00000
title: Mulliken charges with hydrogens summed into heavy atoms:
elementType: O O O N C C C C C C C C C C C C C C C C C C C C
charge: -0.315847 -0.010704 -0.256921 -0.272133 0.019397 0.154661 0.020450 0.150006 0.119659 0.237962 0.121788 -0.109736 -0.120302 0.000171 0.007242 0.102214 0.281504 -0.187365 0.317778 -0.138064 -0.113634 -0.006038 0.002627 -0.004716
polarizability: 3.30890872e+02 -1.95118190e+01 2.97807386e+02 1.46637583e+01 8.70059489e+00 1.31869279e+02
1716.lowfreq: -9.1556 -4.2370 0.0004 0.0006 0.0006 5.3384 24.6939 31.3905 39.3861
frequency: 24.6861 31.3580 39.3668 52.4640 68.3290 85.9838 89.5684 97.0855 128.7830 144.8525 162.4787 174.9833 199.5229 206.5352 238.6396 260.2729 283.1763 285.4221 291.5494 302.8097 313.2251 347.7531 390.4574 400.9015 422.2212 455.8030 458.5373 477.4061 487.9812 490.6087 515.7794 571.1784 607.1083 612.8239 615.9608 636.4339 668.3026 687.7865 697.0356 706.7907 734.4300 751.0979 772.3122 782.4490 794.7669 811.7316 833.2147 846.3903 852.0383 873.2394 896.2218 915.3364 933.3923 963.9171 983.0977 984.6809 987.6946 989.1770 994.3034 1001.1400 1027.0206 1041.4570 1049.7589 1071.2607 1079.0189 1086.5665 1115.5226 1122.3224 1159.3208 1174.9011 1179.7151 1184.9685 1190.8402 1194.6380 1232.3100 1249.2606 1271.1792 1275.0275 1278.7167 1285.5587 1302.2270 1315.8718 1337.4025 1338.8815 1358.5232 1363.2106 1374.7611 1385.2932 1398.9037 1399.9364 1436.3362 1439.7748 1451.9546 1461.6586 1472.6606 1474.9295 1476.3245 1479.1512 1481.1062 1487.2468 1489.8836 1507.9856 1551.8498 1582.2887 1587.6494 1611.8583 1613.6705 1631.8068 2065.2310 2932.1329 2944.1599 2973.8285 2989.0492 2990.9989 3030.1688 3044.3456 3054.0937 3083.6873 3087.3611 3094.6393 3095.1313 3130.1731 3139.3219 3152.5762 3152.6843 3164.7022 3175.5637 3176.4001 3183.7281
redmass: 3.6103 3.7424 4.5970 3.8195 3.8691 2.4517 2.3523 5.7170 5.0099 2.8129 3.1859 2.5685 2.0311 2.5954 1.9940 2.9567 2.9540 3.2854 3.3536 3.5069 5.4021 4.7301 3.3124 2.8080 5.2074 4.0676 3.3933 4.1914 5.4257 5.2475 3.3957 7.8747 6.0335 6.0354 6.4194 4.8009 4.3638 2.6188 2.1559 4.6091 5.0254 2.9309 2.8707 2.0765 1.1831 1.4046 4.7204 1.3927 1.3874 1.6312 2.3903 3.6825 1.4546 3.0027 1.4477 2.4886 1.5575 3.7399 2.3569 1.3292 2.5029 2.9665 2.5559 2.1383 1.9632 1.5891 2.0068 2.1486 1.8667 1.0613 1.8737 2.0453 2.2843 1.1886 1.2535 1.9846 1.8632 1.6892 1.6854 1.3846 1.2404 1.7566 2.6083 1.7103 1.3773 1.3580 3.4859 8.1221 1.2293 1.2180 3.1856 2.9221 1.1655 1.5220 1.1541 1.2496 1.0746 1.0672 2.3219 1.1543 1.1727 1.8077 8.4161 4.6279 4.2157 4.3284 6.0657 7.4239 1.0767 1.0702 1.0681 1.0598 1.0364 1.0363 1.1007 1.0941 1.0918 1.0987 1.0982 1.1011 1.1009 1.0851 1.0885 1.0932 1.0890 1.0970 1.0983 1.0967 1.0914
irintensity: 0.0790 0.0336 0.5085 0.2619 0.0121 0.2035 0.1827 0.3731 1.0336 4.7104 3.2740 4.9267 0.0460 0.4620 0.7467 2.9153 6.8366 2.5885 1.8079 3.5170 0.8485 6.6815 34.9011 0.1825 3.8734 4.7212 9.4728 13.6155 18.9143 4.2655 9.6942 6.3523 2.9965 9.7632 1.0421 8.6937 7.6864 22.5398 27.7798 5.4956 3.7659 31.7485 20.5689 55.6189 10.4384 3.7824 8.1753 47.4616 11.0059 13.5445 1.0965 18.5832 3.0061 5.1197 1.2396 3.0101 2.6883 0.7645 13.6286 0.2047 63.6526 100.4591 41.6980 29.5023 1.8347 16.2007 22.3604 15.3693 4.9236 0.8286 28.4669 33.8120 29.1959 24.2491 4.1821 10.9858 52.8137 61.8899 10.3303 39.0634 78.6043 107.7151 305.9101 65.4557 36.8643 13.6819 91.9855 15.7465 26.5251 16.3254 93.1227 0.2799 106.6725 59.5847 5.7431 29.2667 14.4641 6.5619 16.0649 10.0069 8.4028 141.1773 125.2092 13.1116 119.2925 305.3177 13.6635 322.4823 1184.4598 27.0439 46.9604 25.0650 23.7497 17.4490 11.3557 5.5994 8.3818 25.5847 66.1613 27.4528 25.8085 1.4025 5.5090 21.6020 2.3072 27.4594 10.4222 9.5071 6.0850
temp: 298.150 k
press: 1.00000 atm
elementType: 8 8 8 7 6 6 6 6 6 6 6 6 6 6 6 6 6 6 6 6 6 6 6 6 1 1 1 1 1 1 1 1 1 1 1 1 1 1 1 1 1 1 1 1 1
symmnumber: 1
zpe: 952078.4 jmol-1
zpe.correction: 0.362628 hartree
zpe.thermalcorrener: 0.384487 hartree
zpe.thermalcorrenthalpy: 0.385431 hartree
zpe.thermalcorrgfe: 0.310589 hartree
zpe.sumelectzpe: -1053.425448 hartree
zpe.sumelectthermal: -1053.403589 hartree
zpe.sumelectthermalent: -1053.402644 hartree
zpe.sumelectthermalfe: -1053.477487 hartree
dipole: -1.2476 -8.7074 0.7770
dipole: 8.8306
quadrupole: -127.4312 -150.6924 -142.3467
quadrupole: -1.4366 -1.1362 1.9424
quadrupole: 12.7255 -10.5356 -2.1899 -1.4366 -1.1362 1.9424
hfenergy: -1053.7880757 hartree
pointgroup: C01 [X(C20H21N1O3)]
dipole: -0.0555513 3.4470322 -0.4302721 debye
polarizability: 335.4890296|14.2728118|294.0402755|-11.6897517|4.7995709|131.038232 unknown
InChI: InChI=1S/C20H21NO3/c1-3-21(4-2)13-16-17(22)11-10-15-18(23)12-19(24-20(15)16)14-8-6-5-7-9-14/h5-12,22H,3-4,13H2,1-2H3
charge 0 multiplicity 1
45 atoms
O  0.838974 -0.097997 0.176149
O  -3.971282 -0.395962 0.43543
O  1.245745 -4.259774 0.113975
N  -2.911593 1.805136 -0.217265
C  -1.626058 1.292202 0.392652
C  -1.548321 -0.225978 0.30899
C  -0.318275 -0.9114 0.233402
C  -2.838456 1.778677 -1.721901
C  -3.284526 3.154678 0.320833
C  -0.221026 -2.328087 0.220796
C  -2.742153 -1.013032 0.378783
C  -1.42807 -3.076415 0.303282
C  -2.669222 -2.438312 0.380252
C  -4.224646 1.775294 -2.388857
C  -3.893656 3.090901 1.73313
C  1.09987 -2.989282 0.133632
C  2.108835 -0.6999 0.092046
C  2.243784 -2.069657 0.075635
C  3.195164 0.303146 0.043327
C  4.519307 -0.07488 -0.314183
C  2.934695 1.666078 0.356165
C  5.552921 0.881738 -0.347177
C  3.971919 2.620926 0.321653
C  5.286095 2.234609 -0.028459
H  -1.62174 1.603384 1.454699
H  -0.746945 1.762176 -0.092076
H  -2.226695 2.635841 -2.080089
H  -2.300857 0.854058 -1.999095
H  -2.39269 3.821115 0.309687
H  -4.023525 3.593466 -0.371487
H  -1.341663 -4.167856 0.300025
H  -3.605297 -3.000512 0.439874
H  -4.818503 0.910343 -2.045212
H  -4.797596 2.697018 -2.181273
H  -4.108726 1.698747 -3.484914
H  -4.802418 2.46431 1.742706
H  -3.188852 2.676898 2.47573
H  -4.169165 4.107252 2.067773
H  3.237348 -2.521699 0.037177
H  -3.767388 0.654766 0.20313
H  4.741173 -1.11279 -0.582719
H  1.91971 1.963139 0.634068
H  6.566185 0.574343 -0.627503
H  3.756466 3.665785 0.571057
H  6.091653 2.976407 -0.055746
