program: Gaussian 09
title: 000034908
version: EM64L-G09RevD.01
frameworkgroup: C1[X(C9H13Cl3N4)]
method: RPBEPBE
basis: SDD
operation: Freq
keyword: #p
keyword: freq=noraman
keyword: PBEPBE/SDD
title: #p freq=noraman PBEPBE/SDD
converged: YES YES NO NO
title: Mulliken charges:
elementType: Cl Cl Cl N N N N C C C C C C C C C H H H H H H H H H H H H H
charge: 0.095957 0.125866 0.110234 0.008633 -0.060492 -0.037286 -0.571690 -0.381909 -0.345472 -0.495596 -0.345672 0.081053 -0.694091 0.284997 -0.000754 -0.771615 0.218390 0.208738 0.202236 0.193534 0.234717 0.225459 0.192768 0.191749 0.212049 0.214807 0.211435 0.348137 0.343818
chargesum: 0.00000
title: Mulliken charges with hydrogens summed into heavy atoms:
elementType: Cl Cl Cl N N N N C C C C C C C C C
charge: 0.095957 0.125866 0.110234 0.008633 -0.060492 -0.037286 0.120265 0.045219 0.050298 -0.035419 0.038845 0.081053 -0.055800 0.284997 -0.000754 -0.771615
polarizability: 1.69932291e+02 1.34417188e+00 1.60119249e+02 -1.21479617e+01 -1.45840028e+01 1.36442050e+02
1716.lowfreq: -8.9186 -2.7071 0.0020 0.0021 0.0024 6.8555 8.3637 10.0771 35.1473
frequency: 7.1404 8.7951 35.0159 68.5365 83.1733 106.0981 119.4416 144.3532 165.5101 176.9202 205.8087 212.9975 217.1136 229.1983 237.4188 292.2480 302.2343 326.1032 378.9318 384.7901 421.1628 487.1068 544.7629 551.4431 567.9776 578.9791 625.6849 693.0725 715.9344 733.8072 749.9886 760.1338 795.5886 832.2635 852.8045 899.2251 911.4605 914.7897 940.4890 989.8021 1005.7069 1046.6219 1070.4893 1085.8659 1106.6984 1116.0759 1178.8877 1211.7991 1230.1933 1268.4630 1280.8659 1290.1240 1291.8415 1330.0750 1333.1242 1354.5545 1374.4722 1392.0636 1445.6323 1455.8354 1460.9406 1467.3960 1473.3939 1477.8881 1478.9725 1488.0332 1524.5917 1619.5589 2961.0658 2968.0509 2973.5657 2981.3840 2999.2056 3008.1513 3022.6550 3048.0145 3070.6154 3072.2535 3086.8192 3545.1462 3702.9604
redmass: 5.8457 10.6400 4.2254 1.5775 9.3870 3.4605 4.6910 3.9668 3.0071 7.1382 9.5892 6.2582 5.6375 3.2907 1.3889 15.3006 7.8245 2.9818 12.0029 2.7813 3.4296 3.5910 3.1035 1.5075 1.0637 5.9406 8.9582 3.1233 3.4002 1.3633 8.7821 7.0146 1.6668 3.5672 2.3158 4.5928 3.3828 1.8626 1.8565 3.5826 2.0735 3.0275 2.6584 2.5297 2.0357 1.8698 1.9937 1.4591 2.4799 1.4220 1.2626 1.5436 1.2001 1.7886 1.8262 1.8090 2.9814 1.2232 1.6483 2.1662 1.3590 1.1205 1.9074 1.0797 1.1983 1.0898 2.9563 1.7776 1.0589 1.0599 1.0362 1.0593 1.0982 1.0627 1.1014 1.1040 1.1006 1.0994 1.1009 1.0446 1.1059
irintensity: 0.3353 0.0283 0.2794 0.0321 0.1967 0.1781 0.1760 0.6125 0.3517 5.8088 2.8321 0.1501 1.5799 0.9182 0.2403 0.0680 0.4733 5.0244 0.1755 0.0585 1.7789 8.1816 51.2024 250.3676 3.4528 14.7918 60.8609 5.1649 48.9314 26.7465 133.7422 104.2201 5.0854 1.7290 3.8178 3.6868 9.3798 9.0745 14.5131 1.3572 1.5445 2.7100 3.9393 2.1535 2.3671 9.2625 38.6410 14.6391 5.6480 3.0720 4.1591 10.6875 4.2425 12.0401 17.2372 26.2965 23.3091 12.0849 125.6956 60.5609 65.9624 2.7209 110.4366 5.6697 49.9084 28.8508 284.5944 488.3401 5.2394 29.9014 33.4634 75.1995 0.3703 18.6267 7.4998 52.2555 83.1826 56.3323 19.4315 132.6664 55.9393
temp: 298.150 k
press: 1.00000 atm
elementType: 17 17 17 7 7 7 7 6 6 6 6 6 6 6 6 6 1 1 1 1 1 1 1 1 1 1 1 1 1
symmnumber: 1
zpe: 571625.7 jmol-1
zpe.correction: 0.217721 hartree
zpe.thermalcorrener: 0.235390 hartree
zpe.thermalcorrenthalpy: 0.236334 hartree
zpe.thermalcorrgfe: 0.167484 hartree
zpe.sumelectzpe: -1948.719939 hartree
zpe.sumelectthermal: -1948.702270 hartree
zpe.sumelectthermalent: -1948.701326 hartree
zpe.sumelectthermalfe: -1948.770176 hartree
dipole: -2.4713 3.9782 -1.1244
dipole: 4.8164
quadrupole: -117.6310 -103.4007 -112.5588
quadrupole: 3.5558 -2.4486 -6.6276
quadrupole: -6.4342 7.7961 -1.3619 3.5558 -2.4486 -6.6276
hfenergy: -1948.9376601 hartree
pointgroup: C01 [X(C9H13Cl3N4)]
dipole: 0.5701882 -1.6535282 -0.7289893 debye
polarizability: 171.6322835|-2.2245537|156.0893377|12.9204373|14.7102374|138.7719687 unknown
InChI: InChI=1S/C9H13Cl3N4/c1-2-3-4-5-6-14-7(9(10,11)12)16-8(13)15-6/h2-5,13H2,1H3
charge 0 multiplicity 1
29 atoms
Cl -1.38616 2.955875 -0.203638
Cl -4.01762 1.509614 -0.524855
Cl -2.806426 1.798174 2.216329
N  -0.491033 0.146834 1.007882
N  -0.094626 -1.999643 -0.039833
N  -2.05886 -0.676355 -0.648439
N  -1.643129 -2.75908 -1.635792
C  2.787827 -1.079287 0.731721
C  3.003386 0.310231 0.091963
C  1.514381 -1.165758 1.623761
C  4.303936 0.386521 -0.740403
C  0.245754 -1.000164 0.82838
C  4.521664 1.772135 -1.385851
C  -1.616919 0.237031 0.241995
C  -1.249739 -1.795527 -0.754079
C  -2.428872 1.529223 0.413703
H  2.722309 -1.854058 -0.057047
H  3.663372 -1.332894 1.361736
H  2.140846 0.566673 -0.556536
H  3.028224 1.083583 0.886906
H  1.539551 -0.383503 2.400968
H  1.489203 -2.157026 2.113852
H  4.277603 -0.392055 -1.530185
H  5.168136 0.13995 -0.089851
H  4.573901 2.563744 -0.614767
H  5.460186 1.805227 -1.969236
H  3.68916 2.026463 -2.068622
H  -2.498077 -2.622743 -2.170926
H  -1.076581 -3.597583 -1.741838
