program: Gaussian 09
title: 000038849
version: EM64L-G09RevD.01
frameworkgroup: C1[X(C19H20N3O6P)]
method: RPBEPBE
basis: SDD
operation: Freq
keyword: #p
keyword: freq=noraman
keyword: PBEPBE/SDD
title: #p freq=noraman PBEPBE/SDD
converged: YES YES NO NO
title: Mulliken charges:
elementType: P O O O O O O N N N C C C C C C C C C C C C C C C C C C C H H H H H H H H H H H H H H H H H H H H
charge: 1.219838 -0.550978 -0.595137 -0.340958 -0.253109 -0.288666 -0.257208 -0.411278 -0.428326 -0.454984 -0.386338 -0.385628 -0.393719 -0.367748 0.361767 -0.369584 -0.336637 -0.434278 -0.328036 0.488933 0.239496 0.381878 -0.400986 -0.299815 0.240437 -0.327246 -0.325066 0.173591 -0.499842 0.256507 0.269699 0.266727 0.255944 0.255469 0.262182 0.267176 0.251341 0.254984 0.302403 0.227876 0.298472 0.335571 0.257048 0.305480 0.273348 0.273029 0.241969 0.242376 0.232026
chargesum: 0.00000
title: Mulliken charges with hydrogens summed into heavy atoms:
elementType: P O O O O O O N N N C C C C C C C C C C C C C C C C C C C
charge: 1.219838 -0.550978 -0.595137 -0.340958 -0.253109 -0.288666 -0.257208 -0.411278 -0.428326 -0.119413 0.139868 0.137044 0.123933 0.150769 0.361767 -0.114600 -0.034234 -0.206402 -0.029564 0.488933 0.239496 0.381878 -0.143938 0.005665 0.240437 -0.053898 -0.052038 0.173591 0.216529
polarizability: 4.99085449e+02 1.63939988e+01 2.36997237e+02 9.35651833e+00 -2.71198310e+01 1.79560436e+02
1716.lowfreq: -3.4431 -0.0012 -0.0005 0.0005 2.6982 7.0999 8.3601 14.6097 21.4996
frequency: 8.2022 14.4284 21.4810 25.1711 28.4332 37.7408 50.5178 57.2015 63.5889 63.9138 76.8383 89.1318 93.0811 107.3125 120.5890 133.6150 144.0327 165.6945 175.4958 185.9737 200.9144 212.9446 248.1328 271.7732 283.4923 293.6283 313.5469 334.4746 349.5832 353.7301 373.1827 381.6766 385.7782 413.0565 415.4966 437.2823 465.4174 501.9480 504.8840 515.0826 537.6446 592.5734 618.0503 625.3755 632.6849 641.1106 657.6919 675.9787 688.4955 708.5559 719.0593 745.7386 752.7678 776.7753 787.5133 805.0059 808.9584 819.2051 824.4670 825.6249 848.5122 860.0588 863.5650 871.7935 882.3493 910.4517 922.3626 941.8771 951.0010 985.3754 987.1830 995.4947 997.7562 998.3197 1004.2580 1007.5826 1025.8259 1069.2340 1073.6669 1080.5015 1114.2546 1114.4574 1117.2708 1119.8330 1120.3162 1124.8961 1125.8260 1138.5666 1148.7269 1149.3476 1154.9733 1165.5134 1172.7662 1197.7200 1205.5173 1235.6757 1254.5052 1260.2626 1262.2314 1298.4125 1309.3923 1367.3092 1381.1310 1417.4297 1419.1859 1424.0214 1448.3356 1451.6115 1452.8336 1464.0024 1464.2700 1468.7689 1485.8347 1493.3822 1509.2989 1577.6441 1593.7885 1614.4695 1621.5732 1624.6241 1685.3935 3002.9810 3082.6204 3086.8800 3089.3747 3096.3510 3103.7926 3122.1262 3146.8504 3155.5168 3160.9221 3171.5629 3173.0846 3176.2384 3192.0710 3192.5539 3194.1318 3209.4400 3211.3454 3211.4883 3544.2633
redmass: 4.8900 5.2706 6.2938 4.4176 5.4614 3.6575 4.5787 4.1970 6.2693 4.0322 4.6011 2.1846 2.2873 2.9624 5.1706 3.3807 5.3928 5.0566 5.8027 5.5156 5.5203 4.9607 6.8163 4.9066 7.2882 5.0472 7.1152 5.7128 5.6326 6.6889 5.2768 6.8969 5.7722 2.9989 3.1261 6.4172 6.5323 4.0149 3.6578 6.7107 3.5794 8.8829 7.3004 8.9368 7.9055 1.5969 8.2310 4.5622 3.1914 9.4418 3.8071 6.2421 4.4527 8.8878 6.3363 1.0849 1.1141 1.3964 6.2038 8.8866 1.2905 2.7882 2.0087 1.5698 4.4660 4.8112 8.0601 1.3671 8.9531 1.3207 1.3431 1.0638 1.3411 1.0924 2.8862 3.0394 9.1389 4.1586 1.2748 1.2632 1.3692 1.2634 1.3297 1.3331 1.3182 1.2846 1.2837 2.7227 1.4023 1.6550 1.3925 1.7157 1.7584 1.5070 2.1123 3.2424 4.0675 3.0737 2.5523 1.2690 1.3912 5.9695 6.6915 3.8608 3.5446 1.2116 1.0753 1.0499 1.0769 1.1688 1.0527 1.1688 2.4247 2.2384 2.5049 8.1094 5.4958 6.5656 6.3245 9.2214 9.7001 1.0296 1.0494 1.0503 1.0608 1.0583 1.1044 1.0902 1.1046 1.0885 1.0919 1.0950 1.0922 1.0961 1.0947 1.1182 1.1190 1.1178 1.1183 1.0949 1.0761
irintensity: 1.3215 0.5208 0.4714 0.4918 1.7836 2.5388 0.6408 4.0762 2.1787 1.0967 4.6327 1.7827 0.5246 0.0718 5.5038 1.2508 3.6957 0.6148 11.7212 12.7024 12.4345 7.5468 2.9658 9.1292 3.2099 13.5306 0.3003 9.7048 3.7641 10.1932 7.2574 6.4852 5.3160 0.0072 0.1792 27.9956 9.4859 11.0430 22.5809 19.5684 43.9122 162.2222 2.1654 49.0967 37.2783 24.2692 120.3598 6.9578 85.7573 15.0452 0.4313 35.8555 14.2853 23.0256 70.6597 56.8909 25.5079 43.1187 200.5525 28.4994 7.1574 13.6041 35.8888 74.7348 150.4799 241.0827 2.3248 0.6893 394.6774 1.5393 0.0185 4.1587 0.5847 2.8544 20.2936 63.1052 82.4070 305.5657 6.1147 11.2838 77.9720 0.0690 2.9850 34.9844 15.5155 11.8599 7.4786 1217.2069 0.2737 57.9283 0.1122 130.6223 72.1167 285.7070 37.7063 52.6641 384.6445 157.8926 51.0797 11.0273 9.1467 71.6454 0.8979 107.2145 5.5264 64.2364 9.1593 13.9374 7.2306 5.5472 11.6044 0.5729 493.7934 93.8013 622.9604 46.6561 48.6959 55.2554 1.1423 256.0875 268.6382 47.9317 11.3175 15.4735 18.0015 26.0760 27.4676 19.2826 15.9801 1.0318 1.1420 4.7622 3.2363 3.0440 2.7422 0.7778 1.8452 7.8196 17.9749 3.6084 34.7550
temp: 298.150 k
press: 1.00000 atm
elementType: 15 8 8 8 8 8 8 7 7 7 6 6 6 6 6 6 6 6 6 6 6 6 6 6 6 6 6 6 6 1 1 1 1 1 1 1 1 1 1 1 1 1 1 1 1 1 1 1 1
symmnumber: 1
zpe: 960110.1 jmol-1
zpe.correction: 0.365687 hartree
zpe.thermalcorrener: 0.394777 hartree
zpe.thermalcorrenthalpy: 0.395721 hartree
zpe.thermalcorrgfe: 0.299283 hartree
zpe.sumelectzpe: -1690.646210 hartree
zpe.sumelectthermal: -1690.617120 hartree
zpe.sumelectthermalent: -1690.616176 hartree
zpe.sumelectthermalfe: -1690.712614 hartree
dipole: -3.0335 -2.6168 1.4778
dipole: 4.2701
quadrupole: -164.3098 -167.0294 -168.6377
quadrupole: 25.5654 -10.0945 1.7808
quadrupole: 2.3492 -0.3704 -1.9787 25.5654 -10.0945 1.7808
hfenergy: -1691.0118968 hartree
pointgroup: C01 [X(C19H20N3O6P1)]
dipole: 1.2149057 1.1505625 0.1502698 debye
polarizability: 499.603801|6.7384786|247.4109682|-12.9557516|-0.8148188|168.6283526 unknown
InChI: InChI=1S/C19H20N3O6P/c1-26-18(23)14-2-6-16(7-3-14)27-19(24)20-15-4-8-17(9-5-15)28-29(25,21-10-11-21)22-12-13-22/h2-9,20H,10-13H2,1H3
charge 0 multiplicity 1
49 atoms
P  6.118531 -1.134213 0.197826
O  5.178859 0.125369 -0.626241
O  5.415813 -2.568163 0.242939
O  -2.614609 1.083546 -0.1079
O  -1.431031 -0.99383 -0.169014
O  -8.390595 -1.754564 0.077056
O  -9.053745 0.476947 0.189881
N  6.51063 -0.347343 1.749093
N  7.647036 -1.056903 -0.635268
N  -0.380253 1.126429 -0.23456
C  6.839238 -1.273979 2.915228
C  5.513178 -0.543843 2.886145
C  7.751795 -0.994629 -2.137109
C  8.186066 0.191577 -1.285569
C  3.778794 0.298782 -0.478643
C  3.309365 1.630737 -0.442671
C  2.870697 -0.784735 -0.429324
C  1.926096 1.877543 -0.366602
C  1.48533 -0.536284 -0.340097
C  1.004527 0.798477 -0.311988
C  -1.448732 0.25705 -0.172228
C  -3.944536 0.592784 -0.05301
C  -4.914634 1.621258 0.029189
C  -4.321537 -0.772453 -0.080765
C  -6.679374 -0.07615 0.056038
C  -6.276581 1.285595 0.083505
C  -5.693603 -1.09142 -0.025801
C  -8.134895 -0.377781 0.114945
C  -9.820317 -2.134238 0.130194
H  7.655816 -0.90634 3.542327
H  6.821301 -2.354555 2.728875
H  4.614981 -1.142252 2.690787
H  5.367084 0.353922 3.492891
H  8.499757 -1.669834 -2.561996
H  6.825853 -0.885305 -2.713856
H  7.545175 1.079377 -1.292702
H  9.248515 0.365907 -1.092159
H  4.029058 2.453569 -0.478884
H  3.248327 -1.811589 -0.456936
H  1.56403 2.913075 -0.345744
H  0.779823 -1.368469 -0.300827
H  -0.62854 2.118105 -0.225693
H  -4.583085 2.663344 0.048241
H  -3.56499 -1.554668 -0.14148
H  -7.04588 2.061558 0.147079
H  -6.008484 -2.138161 -0.046535
H  -10.275683 -1.780208 1.070531
H  -10.365722 -1.693628 -0.721403
H  -9.821552 -3.232013 0.077533
