program: Gaussian 09
title: 000031148
version: EM64L-G09RevD.01
frameworkgroup: C1[X(C15H22NO5PS2)]
method: RPBEPBE
basis: SDD
operation: Freq
keyword: #p
keyword: freq=noraman
keyword: PBEPBE/SDD
title: #p freq=noraman PBEPBE/SDD
converged: YES YES NO NO
title: Mulliken charges:
elementType: S S P O O O O O N C C C C C C C C C C C C C C C H H H H H H H H H H H H H H H H H H H H H H
charge: 0.050166 -0.210921 0.611875 -0.328971 -0.457462 -0.512400 -0.209363 -0.295750 -0.374301 -0.235697 0.590762 -0.694036 -0.692329 -0.499385 -0.490434 0.352698 -0.190637 -0.422224 -0.458503 0.280565 -0.772478 0.270017 -0.480741 -0.480831 0.205773 0.210948 0.225988 0.217447 0.225576 0.210319 0.219674 0.294202 0.235900 0.227223 0.257014 0.362554 0.269008 0.330298 0.303948 0.349035 0.248174 0.235322 0.249844 0.239575 0.238140 0.294420
chargesum: 0.00000
title: Mulliken charges with hydrogens summed into heavy atoms:
elementType: S S P O O O O O N C C C C C C C C C C C C C C C
charge: 0.050166 -0.210921 0.611875 -0.328971 -0.457462 -0.512400 -0.209363 -0.295750 -0.025266 -0.029924 0.590762 -0.039653 -0.036760 -0.205184 -0.254535 0.352698 0.036587 -0.165210 0.173058 0.280565 -0.138233 0.270017 0.252600 0.291305
polarizability: 3.06992129e+02 -1.36504323e+01 2.94447329e+02 -1.69856592e+01 1.54602791e+01 1.70537558e+02
1716.lowfreq: -11.8293 -8.2338 -5.2044 -1.6313 -0.0015 0.0004 0.0015 16.1153 18.7703
frequency: -10.0235 15.4289 17.7036 25.0852 27.4309 34.5143 40.7432 56.3568 64.2077 70.3797 80.3631 97.9283 113.3138 119.3340 123.3295 132.4180 141.8514 151.5994 156.6962 178.4462 193.2492 206.9752 219.5347 238.9316 240.9075 249.4660 252.2354 280.9662 301.7232 309.8802 317.9250 322.4897 349.3841 365.1262 398.7008 418.6099 444.4747 454.3113 457.4949 532.0040 553.3071 559.7164 603.8876 617.9309 622.8673 639.9132 676.3123 682.4605 687.1859 694.9188 704.7325 718.0146 799.1605 802.2276 824.1128 866.2223 899.7183 908.0963 911.8326 919.9674 948.1582 951.5587 954.9413 967.0974 975.1632 987.3524 1007.0251 1072.6110 1080.4424 1103.8654 1109.1196 1113.3030 1117.4343 1125.8140 1137.1296 1142.4256 1154.3109 1165.5173 1168.5276 1176.9383 1204.9134 1229.6986 1236.9690 1240.8005 1287.5185 1306.8172 1335.2888 1354.3269 1377.8881 1386.0527 1396.7786 1402.7137 1423.3385 1425.9946 1438.5941 1455.2416 1457.4455 1464.4751 1465.4544 1467.9020 1468.4693 1469.3684 1470.5607 1478.5692 1487.9163 1492.3697 1599.5955 1604.8431 1619.0264 1660.8747 2944.8897 2973.5871 2976.6870 2981.4235 2981.6120 2988.4514 3001.7593 3014.1228 3067.1227 3074.2324 3076.5430 3081.4089 3083.5971 3098.6834 3101.1584 3124.9086 3129.1176 3130.8717 3147.0190 3172.0552 3188.6497 3541.8657
redmass: 4.0147 5.0409 4.4867 5.2307 4.0290 3.9008 7.4532 5.5292 5.5645 3.4862 5.1557 6.5450 4.2843 1.4207 3.6596 3.2111 2.2784 1.9666 2.2763 4.9475 2.1764 1.2528 2.6124 2.9241 1.8296 4.2777 7.8818 4.4160 3.0820 6.4757 3.5127 5.7482 4.8716 5.4556 4.3758 8.5241 3.4136 3.0077 3.0110 15.6686 3.2718 4.4928 2.2161 2.5364 2.6769 10.9983 5.4973 12.2385 8.6067 6.1041 2.0195 4.6392 1.5201 1.7497 4.5661 3.3245 1.4187 1.8214 2.0201 1.2050 11.4863 3.0979 1.4454 11.3875 1.3409 5.6378 2.5512 1.5528 1.6433 3.2875 1.2251 2.5589 1.2513 1.2961 1.7517 1.3522 1.6923 1.9902 1.5587 1.4091 2.0878 1.2294 1.8775 1.2936 1.5393 1.3247 1.6244 1.6319 1.1957 4.6761 1.2981 1.0824 1.1201 1.1175 2.4453 1.0481 1.2420 1.0517 1.0455 1.0530 1.0946 1.0562 1.8111 1.0496 1.1888 1.7254 6.2073 6.8356 8.3707 10.1058 1.0661 1.0348 1.0363 1.0827 1.0306 1.0282 1.0626 1.0911 1.1002 1.0994 1.1005 1.0997 1.1051 1.0998 1.1057 1.0873 1.1062 1.1027 1.0930 1.0974 1.0919 1.0770
irintensity: 0.0592 0.5713 0.0753 0.4264 1.1558 0.3770 1.6464 4.3125 6.4766 3.4601 2.9497 2.8566 4.7306 1.6153 2.6368 5.0749 0.5269 2.4992 1.7425 3.4519 5.7738 1.1038 5.0617 3.3067 4.8737 3.7971 5.2291 10.0432 6.3939 5.3992 1.1370 8.5363 5.0609 10.3305 37.0271 33.6671 2.2747 2.2413 2.5837 106.6936 1.7449 2.2445 40.9290 28.3248 30.0214 97.2249 31.0446 129.9104 13.5228 20.6945 48.2705 8.6687 43.3402 6.9727 5.7463 14.8504 1.8614 16.9404 14.4094 0.7712 263.8775 96.2754 0.2687 80.0404 1.4268 2.0933 79.3322 4.7310 12.6158 4.2260 0.9014 1.1752 0.1778 0.2852 88.3665 5.4265 13.0893 478.6909 156.7665 62.4799 96.3110 24.6178 50.1943 4.1593 64.5447 0.5746 10.6716 234.3460 15.0109 7.4600 14.2091 13.2813 5.0756 12.5250 94.5703 16.6098 147.2071 28.4084 4.1695 2.7961 22.8493 12.9887 90.8570 22.9185 137.1205 158.7421 52.2306 19.1050 187.5054 165.4514 29.2461 31.0332 29.8643 26.6084 42.5203 35.8001 3.8026 51.9517 0.2841 103.5030 25.4087 40.0606 20.4751 5.4311 19.1492 8.7910 5.1621 8.1009 26.4812 9.3770 2.8311 78.4215
temp: 298.150 k
press: 1.00000 atm
elementType: 16 16 15 8 8 8 8 8 7 6 6 6 6 6 6 6 6 6 6 6 6 6 6 6 1 1 1 1 1 1 1 1 1 1 1 1 1 1 1 1 1 1 1 1 1 1
symmnumber: 1
zpe: 926761.4 jmol-1
zpe.correction: 0.352985 hartree
zpe.thermalcorrener: 0.381300 hartree
zpe.thermalcorrenthalpy: 0.382244 hartree
zpe.thermalcorrgfe: 0.289265 hartree
zpe.sumelectzpe: -2151.176255 hartree
zpe.sumelectthermal: -2151.147940 hartree
zpe.sumelectthermalent: -2151.146996 hartree
zpe.sumelectthermalfe: -2151.239975 hartree
dipole: 1.2183 -0.5817 1.9639
dipole: 2.3832
quadrupole: -142.2982 -168.4229 -167.2917
quadrupole: 7.5588 11.2040 -5.5148
quadrupole: 17.0394 -9.0853 -7.9541 7.5588 11.2040 -5.5148
hfenergy: -2151.5292397 hartree
pointgroup: C01 [X(C15H22N1O5P1S2)]
dipole: 0.4577324 0.2243147 -0.786945 debye
polarizability: 303.7882666|15.6239492|299.2124991|15.1134986|8.3885369|168.9762508 unknown
InChI: InChI=1S/C13H16NO3S.C2H6O2PS/c1-9(2)10-4-3-5-12(6-10)17-13(16)14-7-11(15)8-18;1-3-5(6)4-2/h3-6,9,14H,7-8H2,1-2H3;1-2H3
charge 0 multiplicity 1
46 atoms
S  5.08424 -0.220252 1.298917
S  5.327155 3.452206 0.777853
P  4.706177 1.646229 0.009987
O  -1.513253 -1.821935 0.347494
O  5.326119 1.183466 -1.55839
O  3.041187 1.37491 -0.334396
O  2.853101 -3.351637 0.095951
O  -0.34776 0.261743 0.295479
N  0.69724 -1.781636 0.775007
C  -5.071046 1.781821 0.001336
C  -4.603569 0.326196 -0.093593
C  -4.871258 2.360172 1.427535
C  -4.366545 2.67212 -1.057732
C  -3.248337 -0.005358 0.172583
C  -5.508806 -0.701291 -0.454347
C  -2.831169 -1.348415 0.065594
C  -5.073846 -2.0440 -0.55165
C  -3.729978 -2.378096 -0.293175
C  2.029325 -1.212431 0.919183
C  3.096971 -2.145964 0.369884
C  4.492136 -1.579218 0.103491
C  -0.376267 -0.986621 0.458898
C  6.758358 1.438188 -1.836026
C  2.155044 2.467553 -0.814074
H  -6.158031 1.79598 -0.217378
H  -5.260562 3.393853 1.48411
H  -5.395644 1.749278 2.184265
H  -3.799604 2.388176 1.698604
H  -4.532595 2.284786 -2.079136
H  -4.750435 3.708382 -1.01115
H  -3.275321 2.705414 -0.882369
H  -2.526502 0.767134 0.442499
H  -6.556161 -0.450291 -0.659807
H  -5.781956 -2.832333 -0.829447
H  -3.36667 -3.407682 -0.359581
H  2.087551 -0.233169 0.407175
H  2.280403 -0.997971 1.981379
H  4.511933 -1.143136 -0.914488
H  5.240731 -2.387013 0.147442
H  0.589552 -2.799061 0.772982
H  7.006803 2.498614 -1.650852
H  7.399264 0.784899 -1.216124
H  6.881957 1.19368 -2.901223
H  2.292366 3.372546 -0.195798
H  2.366502 2.683493 -1.874847
H  1.142999 2.055172 -0.681165
