program: Gaussian 09
title: 000022887
version: EM64L-G09RevD.01
frameworkgroup: C1[X(C18H23NO2)]
method: RPBEPBE
basis: SDD
operation: Freq
keyword: #p
keyword: freq=noraman
keyword: PBEPBE/SDD
title: #p freq=noraman PBEPBE/SDD
converged: YES YES NO NO
title: Mulliken charges:
elementType: O O N C C C C C C C C C C C C C C C C C C H H H H H H H H H H H H H H H H H H H H H H H
charge: -0.416131 -0.230947 -0.117489 -0.259336 -0.488663 -0.359221 0.348500 0.161790 -0.313865 -0.312907 0.151185 -0.393286 0.410350 -0.360736 -0.678185 -0.671004 -0.260038 -0.466533 -0.434630 -0.276094 -0.244284 0.275735 0.211483 0.226322 0.219962 0.191121 0.187798 0.206667 0.182548 0.200026 0.238059 0.243956 0.223972 0.209597 0.207336 0.234154 0.216300 0.203650 0.226837 0.239483 0.237005 0.227560 0.227873 0.374081
chargesum: 0.00000
title: Mulliken charges with hydrogens summed into heavy atoms:
elementType: O O N C C C C C C C C C C C C C C C C C C
charge: -0.042050 -0.230947 -0.117489 0.016399 -0.050858 0.051862 0.348500 0.161790 0.080601 0.069666 0.151185 -0.155228 0.410350 -0.116779 -0.037281 -0.016901 -0.033201 -0.227050 -0.197625 -0.048534 -0.016411
polarizability: 2.19093548e+02 3.32870262e+01 1.97824697e+02 1.08969440e+01 -3.25824133e+01 2.03339866e+02
1716.lowfreq: -14.0342 -5.1031 -3.8474 -0.0003 -0.0002 0.0006 17.1409 21.4416 34.2543
frequency: 15.4377 20.8829 34.2370 40.4888 53.0017 73.8029 79.3947 83.7662 121.5694 133.7190 158.2769 177.9706 202.8285 218.4038 238.8421 258.8898 289.7817 295.5595 331.5132 334.6318 402.9682 411.9492 427.4806 429.1781 460.6728 471.0501 489.5877 501.8463 521.5316 538.6689 578.1042 608.3395 622.0009 647.5965 680.3423 706.2635 741.3520 753.3780 784.6638 789.2561 789.7294 795.9184 805.9026 813.1152 868.1752 877.2451 903.0848 912.6870 918.5019 935.4893 961.5689 983.4296 991.6961 995.1803 1006.0341 1032.3466 1040.0519 1047.7532 1073.1143 1074.8376 1084.7478 1085.8363 1105.5336 1115.1599 1151.0127 1152.7367 1177.4200 1185.4740 1195.4364 1212.3045 1220.9965 1236.6686 1243.2352 1265.4832 1268.2850 1283.2347 1291.4390 1313.3334 1330.0037 1345.1372 1362.1135 1365.7981 1373.9798 1381.3133 1387.1350 1389.6300 1404.7098 1417.0947 1441.9252 1454.8717 1462.8672 1463.5505 1465.4976 1472.9379 1479.6114 1481.6550 1487.2691 1490.9250 1517.1537 1585.1908 1598.7580 1632.4273 1654.6622 2848.4185 2855.4832 2869.4698 2983.1685 2985.6441 3005.6349 3029.1815 3032.6671 3046.2715 3058.2109 3071.2182 3076.1371 3077.4725 3089.6536 3093.0142 3120.7289 3123.3677 3134.1984 3140.8582 3154.9292 3160.1009 3174.1623 3501.0559
redmass: 5.0922 3.9629 4.4076 6.4033 3.8955 3.3856 2.4301 2.2182 5.0346 3.7803 2.7120 3.2147 1.6869 1.3523 3.2128 4.1474 1.9398 2.4202 2.7582 2.1881 3.9921 3.5882 3.3317 2.7948 2.5203 3.2344 3.4559 4.7435 4.6500 3.3472 2.7542 3.2846 2.0521 2.8010 3.6121 2.8522 1.3243 3.7856 5.2285 1.9515 1.2353 1.1739 2.2842 1.7073 2.3313 2.0451 2.0488 1.8778 1.9936 2.3945 1.4380 1.3824 1.3601 3.8342 2.1024 2.3590 2.1345 2.4521 1.8636 2.3147 1.9358 2.4077 2.7850 1.8905 1.6033 1.4015 1.1299 1.3202 1.9272 1.5758 1.6129 2.0585 1.7448 1.3853 1.5655 1.1983 1.2239 1.8484 1.4126 1.5263 1.3272 1.3267 1.4046 1.7916 1.2294 1.2294 3.2942 3.6894 2.4611 2.2037 1.0565 1.0598 1.1016 1.0615 1.0635 1.0593 1.0725 1.0754 3.5613 7.4125 5.1338 6.3373 8.3411 1.0723 1.0722 1.0713 1.0357 1.0361 1.0637 1.0862 1.0874 1.0872 1.0888 1.0906 1.0984 1.0980 1.1003 1.1000 1.0861 1.0862 1.0899 1.0914 1.0965 1.0982 1.0959 1.0638
irintensity: 0.1968 0.1603 0.9452 0.8077 0.4189 0.1083 0.4180 0.2712 0.4772 0.1530 1.1655 0.6928 0.9189 0.5752 4.1669 0.0353 0.0489 2.7344 3.6162 0.3294 5.4489 2.0821 15.3639 1.1419 4.5366 0.3903 21.4077 1.7661 2.4721 24.5728 15.3083 42.6594 56.8379 26.7912 14.8417 22.0071 5.9866 7.1890 0.5397 74.6290 2.0432 4.7331 20.4855 42.7575 3.6823 5.0355 2.7117 1.4112 3.9738 11.8784 4.7209 1.0148 0.6046 4.9211 52.5280 13.0195 142.9729 15.2279 17.9971 31.1849 0.3220 10.3353 14.8216 13.3712 3.3463 5.6916 2.8103 5.3105 46.6791 18.4290 5.6254 9.3580 1.3718 15.3406 6.5933 6.7107 17.3233 54.0602 1.4903 20.5839 2.3810 1.9182 2.3175 24.2320 22.5824 11.1104 1.9176 0.7048 6.9095 1.1935 6.1985 5.3654 1.1941 5.9228 3.6732 11.5550 19.8939 21.9200 8.7056 3.0011 5.5536 0.1516 221.9077 39.6170 57.2727 243.4617 32.1017 21.4695 26.4499 11.2068 22.3326 13.3819 20.8969 16.9676 48.2088 69.4337 50.3901 28.9871 1.1581 1.5343 13.6207 21.7584 40.2814 23.5135 11.7870 17.0063
temp: 298.150 k
press: 1.00000 atm
elementType: 8 8 7 6 6 6 6 6 6 6 6 6 6 6 6 6 6 6 6 6 6 1 1 1 1 1 1 1 1 1 1 1 1 1 1 1 1 1 1 1 1 1 1 1
symmnumber: 1
zpe: 970295.2 jmol-1
zpe.correction: 0.369566 hartree
zpe.thermalcorrener: 0.390537 hartree
zpe.thermalcorrenthalpy: 0.391481 hartree
zpe.thermalcorrgfe: 0.317157 hartree
zpe.sumelectzpe: -903.350328 hartree
zpe.sumelectthermal: -903.329358 hartree
zpe.sumelectthermalent: -903.328413 hartree
zpe.sumelectthermalfe: -903.402737 hartree
dipole: 0.5233 -1.7999 -0.0628
dipole: 1.8754
quadrupole: -115.5040 -131.6252 -116.6018
quadrupole: 1.8584 1.1088 0.8729
quadrupole: 5.7397 -10.3815 4.6418 1.8584 1.1088 0.8729
hfenergy: -903.7198942 hartree
pointgroup: C01 [X(C18H23N1O2)]
dipole: 0.1883774 0.7088179 0.080724 debye
polarizability: 221.7888451|-29.9691606|200.6766988|-10.8341824|-34.9719309|197.7925674 unknown
InChI: InChI=1S/C18H23NO2/c1-3-19(4-2)13-12-17(18(20)21)16-11-7-9-14-8-5-6-10-15(14)16/h5-11,17,20H,3-4,12-13H2,1-2H3
charge 0 multiplicity 1
44 atoms
O  0.289503 -2.12754 -2.429438
O  0.581045 -3.631612 -0.686922
N  2.765602 0.899326 0.675863
C  0.698847 -1.190166 -0.232431
C  1.789956 -1.423245 0.844061
C  2.167257 -0.120342 1.581613
C  -0.686003 -0.806114 0.328092
C  -1.509295 0.192358 -0.323799
C  4.192534 0.603127 0.360893
C  2.585569 2.289901 1.182812
C  0.531061 -2.445975 -1.082914
C  -1.175556 -1.455466 1.470224
C  -2.797326 0.529114 0.260626
C  -1.125474 0.865828 -1.533986
C  4.656862 1.218166 -0.973486
C  1.147679 2.818675 1.02668
C  -2.446363 -1.13005 2.032539
C  -3.239899 -0.146014 1.444594
C  -3.618713 1.526941 -0.3629
C  -1.950037 1.828251 -2.121066
C  -3.206551 2.170243 -1.529898
H  1.068142 -0.381128 -0.882899
H  2.684008 -1.845115 0.346232
H  1.468379 -2.185977 1.575317
H  1.254517 0.308183 2.032331
H  2.85553 -0.368442 2.428536
H  4.865049 0.941671 1.19009
H  4.3083 -0.494483 0.298088
H  2.905843 2.371835 2.253562
H  3.26261 2.944721 0.604489
H  -0.576441 -2.239135 1.944912
H  -0.184704 0.603364 -2.024417
H  4.034815 0.840344 -1.803775
H  4.582973 2.320617 -0.969113
H  5.712414 0.954743 -1.173549
H  0.836997 2.780644 -0.031689
H  0.417245 2.229936 1.609826
H  1.086459 3.86621 1.376702
H  -2.790436 -1.659515 2.92758
H  -4.214701 0.117073 1.872373
H  -4.584558 1.771689 0.095594
H  -1.635512 2.322828 -3.046796
H  -3.841893 2.929046 -1.999757
H  0.132471 -2.968117 -2.94089
