program: Gaussian 09
title: 000028233
version: EM64L-G09RevD.01
frameworkgroup: C1[X(C23H32N2O2)]
method: RPBEPBE
basis: SDD
operation: Freq
keyword: #p
keyword: freq=noraman
keyword: PBEPBE/SDD
title: #p freq=noraman PBEPBE/SDD
converged: YES YES NO NO
title: Mulliken charges:
elementType: O O N N C C C C C C C C C C C C C C C C C C C C C C C H H H H H H H H H H H H H H H H H H H H H H H H H H H H H H H H
charge: -0.235861 -0.286918 -0.093995 -0.477673 -0.345501 -0.319723 -0.536466 -0.353021 -0.361964 0.226136 0.156527 -0.687369 -0.683014 0.397997 0.384617 -0.574760 -0.617226 0.392954 -0.830852 -0.841144 -0.402393 0.416971 -0.413302 -0.391491 -0.225473 -0.218699 -0.240558 0.183546 0.201341 0.183793 0.190745 0.192595 0.237919 0.216654 0.211556 0.217059 0.197451 0.295977 0.205094 0.205169 0.223194 0.207037 0.207367 0.222027 0.254617 0.256778 0.292481 0.222524 0.214527 0.220669 0.245260 0.240536 0.219254 0.225421 0.227571 0.263795 0.226134 0.225899 0.228209
chargesum: 0.00000
title: Mulliken charges with hydrogens summed into heavy atoms:
elementType: O O N N C C C C C C C C C C C C C C C C C C C C C C C
charge: -0.235861 -0.286918 -0.093995 -0.181696 0.039386 0.054815 -0.105952 0.075190 0.052546 0.226136 0.156527 -0.053912 -0.046584 0.397997 0.384617 -0.320143 -0.360448 0.392954 -0.101321 -0.134679 0.042283 0.416971 -0.185731 -0.127696 0.000662 0.007200 -0.012349
polarizability: 4.00565145e+02 -7.12834117e+00 2.49301913e+02 4.70444345e+00 2.20006094e+01 1.96120368e+02
1716.lowfreq: -5.9237 -2.5604 -0.0009 0.0012 0.0017 6.2814 11.9934 16.2432 18.7927
frequency: -1.6453 14.0638 18.0109 24.3476 29.9554 50.4257 57.2593 60.2352 64.9135 70.6349 76.7643 94.0604 105.0912 128.9384 146.9479 173.6520 179.0870 188.4734 198.0867 212.2369 214.9473 220.0843 224.8937 229.1738 240.2196 247.9026 259.2844 305.7512 314.4629 322.1578 354.0831 376.4991 385.7326 392.7128 401.4777 440.2067 468.4990 486.2200 502.2893 519.3051 519.6481 548.4918 556.2539 581.0606 601.0900 613.6813 619.1872 650.3502 702.1420 711.2965 736.1206 740.8733 743.4232 747.2308 806.3289 818.9028 823.4321 848.5013 855.3592 867.4037 871.0965 872.6814 895.3360 910.8933 911.4564 919.4775 938.7496 959.5491 968.3936 978.4804 986.4167 989.8972 995.8222 1015.9906 1027.2657 1038.7714 1043.0040 1044.7822 1046.3991 1047.0444 1053.0951 1072.8646 1084.8461 1088.7297 1113.3746 1117.3906 1136.5178 1154.1802 1171.9078 1185.2272 1196.4515 1202.6064 1204.6630 1223.2030 1231.8801 1247.4198 1257.7055 1259.3293 1279.7977 1290.4529 1294.2246 1307.4384 1312.9706 1318.4211 1319.8144 1357.0432 1360.4553 1368.6118 1375.6843 1378.3822 1390.5904 1391.0743 1392.0192 1397.7485 1399.5568 1428.6915 1440.6118 1446.6543 1451.3130 1456.7668 1462.9866 1467.6744 1467.9877 1470.4810 1473.8338 1474.9448 1476.9216 1479.4081 1479.5688 1486.4325 1486.7814 1489.2510 1490.7842 1495.8504 1594.8064 1597.2285 1619.3665 1621.2366 1631.2097 2837.1697 2840.7977 2855.3791 2935.1750 2963.5137 2971.4264 2972.9200 2978.1607 2986.4904 2992.4067 2992.4673 3007.4474 3023.5427 3038.8365 3041.4472 3043.7108 3059.6015 3069.3599 3070.6047 3071.9886 3075.9109 3076.2878 3085.9852 3091.7922 3113.4529 3127.5193 3141.0853 3152.4301 3154.8797 3158.1101 3171.3865 3502.7385
redmass: 3.8168 3.9666 4.2460 4.5286 4.4880 4.1683 2.9296 3.8706 2.3847 2.0428 2.0807 4.6587 3.9581 3.6971 4.1869 1.4674 1.7585 1.9895 3.4270 1.4944 1.9140 1.6808 1.3906 2.5331 2.3584 2.5977 2.7679 3.3013 2.8718 3.5877 3.6392 3.5194 3.3462 4.1788 2.8436 3.4799 2.8978 2.9479 4.4708 3.3577 4.4709 4.7866 2.7559 1.5591 3.2615 4.0337 4.5095 6.1192 2.1710 3.4480 2.2335 1.2008 1.4102 1.4192 4.6559 3.5448 3.5783 1.3800 1.2505 1.3559 1.4019 1.3352 1.5546 2.1287 1.4858 3.7257 5.2920 2.1563 2.5364 1.3845 2.4117 6.1769 1.3338 1.7426 2.1329 1.7933 1.9726 2.4453 1.8494 2.5134 1.7240 2.1656 1.5717 2.0070 2.1141 2.2213 2.0977 1.7897 1.0547 1.1093 2.0777 2.4070 1.2675 1.8716 1.8671 1.2934 1.4650 1.5493 1.3271 1.1998 1.1458 1.9170 1.4410 2.0438 1.4623 1.3966 1.9204 1.4072 1.7614 3.2059 1.2166 4.1161 1.2220 1.2702 1.2420 2.6050 2.1559 1.5007 1.4383 1.1333 1.1532 1.1404 1.1854 1.0850 1.1137 1.1172 1.0588 1.0428 1.0433 2.0645 1.1065 1.0917 1.2762 1.4925 6.4968 6.6854 6.1300 6.0547 6.5422 1.0712 1.0712 1.0711 1.0567 1.0416 1.0360 1.0359 1.0363 1.0618 1.0644 1.1019 1.0856 1.0871 1.1003 1.0929 1.0987 1.0966 1.0997 1.0984 1.0919 1.0987 1.0988 1.1000 1.0980 1.0874 1.0868 1.0929 1.0908 1.0919 1.0973 1.0981 1.0758
irintensity: 0.1712 0.5288 0.2529 0.2091 0.2527 0.3732 0.4209 0.3780 0.4723 0.6849 0.1040 7.0315 2.2937 0.2213 2.7795 3.7302 3.1461 1.1626 1.5465 1.7657 0.4414 0.1868 0.3318 1.5044 1.2756 4.5500 1.1815 0.7680 0.1534 0.5647 4.1601 1.2709 2.1744 4.9819 0.4478 2.1168 13.2343 3.7882 12.0553 0.5494 0.8809 1.1580 21.3205 51.9841 6.5855 15.0298 13.7137 17.6537 33.6255 8.7995 26.4419 10.6554 57.7140 7.8257 17.9830 13.7827 2.2078 12.8597 0.0481 1.8225 16.0036 18.7895 2.2864 3.6250 3.1880 1.2184 3.7691 5.7044 5.4209 0.1470 21.3202 0.4787 0.7066 0.9071 29.4636 19.5351 27.6194 53.6506 41.6318 5.0234 39.9938 55.4239 9.5952 73.5229 17.2106 39.0509 108.5084 55.3986 0.4537 3.7170 6.2692 7.0578 5.4954 1.9847 55.0879 1.5194 18.9463 94.2118 40.8310 8.7039 4.8737 94.8153 4.4568 38.9505 2.6939 0.8024 3.2733 4.8745 5.2353 12.8088 19.9547 4.3686 15.2500 34.1524 3.7038 15.8253 17.0297 42.2741 79.8458 30.6601 41.6159 35.4898 105.5782 35.0495 2.5236 8.8276 4.4637 14.0828 9.2147 6.4502 12.5694 7.8931 69.7884 105.8154 28.3156 10.6664 19.5073 103.4700 140.7570 56.2986 64.9645 213.5717 24.4242 37.8378 51.7167 37.8963 22.7534 20.8165 18.9728 31.4028 23.2786 16.9661 13.9909 19.4952 2.7506 15.8362 55.9836 84.7368 53.1180 34.0753 54.0006 20.6988 21.3963 9.7049 0.8324 29.9194 12.9497 9.7482 36.2539 9.8489 8.7180
temp: 298.150 k
press: 1.00000 atm
elementType: 8 8 7 7 6 6 6 6 6 6 6 6 6 6 6 6 6 6 6 6 6 6 6 6 6 6 6 1 1 1 1 1 1 1 1 1 1 1 1 1 1 1 1 1 1 1 1 1 1 1 1 1 1 1 1 1 1 1 1
symmnumber: 1
zpe: 1315185.6 jmol-1
zpe.correction: 0.500928 hartree
zpe.thermalcorrener: 0.529320 hartree
zpe.thermalcorrenthalpy: 0.530264 hartree
zpe.thermalcorrgfe: 0.438770 hartree
zpe.sumelectzpe: -1153.546287 hartree
zpe.sumelectthermal: -1153.517895 hartree
zpe.sumelectthermalent: -1153.516951 hartree
zpe.sumelectthermalfe: -1153.608445 hartree
dipole: 1.1255 0.7143 -3.0439
dipole: 3.3230
quadrupole: -143.6143 -151.9416 -169.2542
quadrupole: -5.2122 -13.1797 9.2296
quadrupole: 11.3224 2.9951 -14.3175 -5.2122 -13.1797 9.2296
hfenergy: -1154.047215 hartree
pointgroup: C01 [X(C23H32N2O2)]
dipole: 0.4415555 0.2839074 -1.197338 debye
polarizability: 400.3484072|-9.4166988|249.1973212|4.0176574|22.4042115|196.4416968 unknown
InChI: InChI=1S/C23H32N2O2/c1-5-12-25(13-6-2)16-22(26)24-23-18(3)14-21(15-19(23)4)27-17-20-10-8-7-9-11-20/h7-11,14-15,24H,5-6,12-13,16-17H2,1-4H3
charge 0 multiplicity 1
59 atoms
O  2.670307 -1.076603 1.55339
O  -3.547114 -0.296066 -0.324244
N  5.196117 -0.067978 -0.104001
N  2.055564 -1.005076 -0.709342
C  6.567586 -0.200068 0.443671
C  5.079453 0.757638 -1.327432
C  4.437601 -1.335792 -0.141396
C  6.592145 -0.308933 1.984041
C  5.18541 2.273961 -1.051406
C  2.98067 -1.136407 0.329878
C  0.641009 -0.781493 -0.569362
C  8.021255 -0.514481 2.530721
C  5.087651 3.110012 -2.34567
C  0.145404 0.346541 0.140388
C  -0.251404 -1.703038 -1.19995
C  -1.257994 0.522723 0.24347
C  -1.638995 -1.492607 -1.097368
C  -2.145142 -0.391843 -0.367197
C  1.071952 1.367606 0.766642
C  0.286197 -2.903264 -1.95941
C  -4.126178 0.803553 0.460387
C  -5.637076 0.666939 0.455749
C  -6.438387 1.817128 0.663348
C  -6.263171 -0.592636 0.293849
C  -7.845757 1.709878 0.723049
C  -7.671369 -0.698525 0.345311
C  -8.467381 0.449661 0.56424
H  7.104609 -1.078333 0.001243
H  7.142265 0.696561 0.144614
H  5.840377 0.467632 -2.098086
H  4.086097 0.565567 -1.777949
H  4.467139 -1.815909 -1.153021
H  4.891979 -2.044191 0.571416
H  6.141314 0.609628 2.403698
H  5.940433 -1.142395 2.310502
H  4.381387 2.554317 -0.344563
H  6.142106 2.49658 -0.53979
H  2.400381 -1.214779 -1.649994
H  8.471483 -1.446629 2.13844
H  8.68538 0.32398 2.245902
H  8.018576 -0.581056 3.633582
H  5.899754 2.851757 -3.051804
H  4.124916 2.937109 -2.86357
H  5.161759 4.190789 -2.128402
H  -1.630961 1.391729 0.793877
H  -2.347738 -2.182742 -1.565463
H  1.534011 0.95863 1.683805
H  1.906035 1.624889 0.087302
H  0.528165 2.293922 1.018832
H  0.826011 -2.60706 -2.881892
H  0.993286 -3.485013 -1.339348
H  -0.533231 -3.573943 -2.266108
H  -3.821771 1.779311 0.028314
H  -3.732917 0.748966 1.498889
H  -5.964144 2.800472 0.777216
H  -5.641976 -1.47496 0.114496
H  -8.454498 2.606621 0.884437
H  -8.147269 -1.677048 0.214385
H  -9.559109 0.364966 0.605381
