program: Gaussian 09
title: 000010913
version: EM64L-G09RevD.01
frameworkgroup: C1[X(C10H30O5Si5)]
method: RPBEPBE
basis: SDD
operation: Freq
keyword: #p
keyword: freq=noraman
keyword: PBEPBE/SDD
title: #p freq=noraman PBEPBE/SDD
converged: NO NO NO NO
title: Mulliken charges:
elementType: Si Si Si Si Si O O O O O C C C C C C C C C C H H H H H H H H H H H H H H H H H H H H H H H H H H H H H H
charge: 1.647578 1.663418 1.652019 1.658475 1.661008 -0.995553 -0.961599 -1.009246 -1.003790 -0.993135 -1.055358 -1.070566 -1.058657 -1.056670 -1.068639 -1.056882 -1.054063 -1.054725 -1.057667 -1.060064 0.254248 0.241105 0.233919 0.255791 0.236025 0.241758 0.235746 0.241181 0.247462 0.234322 0.249611 0.241375 0.255263 0.244079 0.233769 0.243556 0.252887 0.232715 0.233444 0.240510 0.250494 0.238125 0.237812 0.247158 0.236875 0.246410 0.241537 0.241304 0.236584 0.249049
chargesum: 0.00000
title: Mulliken charges with hydrogens summed into heavy atoms:
elementType: Si Si Si Si Si O O O O O C C C C C C C C C C
charge: 1.647578 1.663418 1.652019 1.658475 1.661008 -0.995553 -0.961599 -1.009246 -1.003790 -0.993135 -0.326085 -0.336991 -0.334269 -0.331362 -0.335528 -0.327723 -0.329615 -0.331628 -0.332845 -0.333127
polarizability: 2.34724762e+02 -1.47509774e+00 2.34743388e+02 -9.09978624e-01 9.43030596e-01 2.17319793e+02
1716.lowfreq: -21.0625 -12.3009 -8.9160 -0.0006 0.0007 0.0016 5.6982 8.1437 10.2964
frequency: -20.1628 -9.1100 -7.4291 26.4560 28.1200 31.2748 39.0678 42.3846 45.6055 125.7811 127.4714 132.5107 133.9017 134.8536 135.7008 136.4455 143.4241 145.6760 146.5097 148.7495 151.7096 153.8702 155.0686 162.8504 165.3166 165.9080 172.7012 182.2020 185.4694 195.5455 198.7911 218.0447 219.9060 238.4952 244.5528 258.0148 267.4461 274.2615 318.0691 322.9148 325.2965 336.0679 357.3817 364.3920 430.9734 449.2868 455.5064 538.4601 544.5402 645.7552 646.7043 674.4500 676.8447 689.0125 711.5401 713.3798 714.5468 717.3193 719.1316 810.2055 812.0941 813.6439 814.1147 815.7996 831.6772 839.6625 840.6474 842.9055 856.0330 866.7237 886.2353 887.8926 891.0345 896.0869 917.5804 918.8209 924.3555 926.6092 928.6348 990.0725 1040.0343 1061.6334 1068.6553 1074.4853 1301.4447 1302.4312 1302.6504 1304.4793 1305.4007 1308.0143 1310.2024 1310.4101 1310.5874 1313.5175 1437.2124 1438.4722 1439.5014 1439.8726 1440.9776 1442.2803 1442.8231 1443.4900 1444.3131 1445.3740 1446.8951 1447.9108 1448.2369 1449.4503 1450.8901 1451.4167 1452.0511 1454.3935 1455.9053 1456.3875 2985.1896 2985.9072 2986.6751 2986.8566 2987.0427 2987.4892 2988.7509 2989.1489 2991.4713 2993.5893 3090.4785 3090.6584 3092.1567 3092.8171 3092.9000 3093.0466 3093.2265 3093.3399 3094.2108 3094.6182 3094.8567 3095.0698 3095.3250 3095.9071 3096.1760 3096.9168 3098.2148 3098.8603 3100.7833 3103.2795
redmass: 3.9799 3.6559 3.8019 3.6937 4.0266 3.9226 4.4539 4.6146 4.3152 1.1367 2.2139 1.2120 1.4744 1.1992 1.0462 1.0440 1.9301 1.2199 1.7285 1.3760 1.0889 1.1738 1.9163 1.4428 1.8007 2.0679 2.5250 2.9388 2.8587 2.9848 3.2017 3.3510 3.3456 3.1897 4.7454 4.1325 4.5943 4.3878 5.1995 6.5806 5.3630 6.7201 6.7507 5.5458 5.2910 5.0279 5.0963 4.4389 4.5965 4.0234 4.0376 3.9112 3.8576 3.7294 2.3168 2.2596 2.2555 2.2627 2.2543 1.2446 1.2519 1.2512 1.2492 1.2514 1.8697 1.9148 1.9385 1.9165 2.0514 1.4178 1.4151 1.4174 1.4068 1.4183 1.5907 1.5995 1.6591 1.6650 1.6188 13.9617 15.0905 15.5004 15.3187 15.4152 1.2170 1.2184 1.2164 1.2178 1.2162 1.2061 1.2051 1.2069 1.2047 1.2045 1.0523 1.0519 1.0513 1.0520 1.0519 1.0516 1.0515 1.0526 1.0525 1.0530 1.0490 1.0486 1.0493 1.0486 1.0472 1.0483 1.0470 1.0474 1.0471 1.0472 1.0345 1.0343 1.0345 1.0343 1.0344 1.0344 1.0344 1.0344 1.0344 1.0345 1.0984 1.0983 1.0986 1.0984 1.0984 1.0982 1.0983 1.0982 1.0982 1.0983 1.0982 1.0981 1.0980 1.0980 1.0983 1.0982 1.0982 1.0983 1.0983 1.0983
irintensity: 0.1315 0.1282 0.3768 2.2193 1.4717 1.0452 1.0484 0.0789 0.5012 0.0588 0.2646 0.2298 0.6007 0.3252 0.0534 0.0097 0.5082 0.1147 0.0748 0.2101 0.0314 0.0663 0.2103 0.0194 0.0893 0.0518 0.0020 0.0276 0.1193 0.0194 0.3988 1.8878 2.6662 1.5316 3.2763 2.8610 6.1015 1.8677 56.4862 59.1851 23.7727 80.1010 99.2246 150.8420 8.4735 3.9301 4.5498 1.2802 3.2243 2.9365 25.8774 41.1580 24.1165 6.5078 0.9050 4.2506 25.3956 15.1367 12.5605 0.0366 0.2077 0.1902 0.1021 0.0281 22.3801 14.0318 50.6842 63.6201 330.1960 1.0238 340.9368 337.8897 5.0228 123.0977 44.4658 32.3748 0.3837 15.6725 0.6162 125.1475 730.4347 1099.2271 334.2535 1096.5579 19.0670 18.3421 19.9451 2.5874 182.5023 11.2532 77.0002 73.2235 100.4813 0.7157 0.5913 1.3861 1.1394 2.4456 1.1196 8.9552 0.4335 5.3657 1.4774 6.0657 0.1247 8.4834 7.6077 17.5576 5.0112 2.5425 0.8513 24.7979 4.7671 26.4859 9.6499 9.6638 10.1294 1.8627 20.0453 7.5943 7.7042 9.0086 9.7360 10.0993 11.1210 9.0797 2.1829 8.7643 17.2793 4.4640 13.4531 12.1917 27.0336 42.0708 9.3976 7.0776 39.0853 28.6500 14.1927 25.3588 17.0491 23.2947 13.5785 14.1711
temp: 298.150 k
press: 1.00000 atm
elementType: 14 14 14 14 14 8 8 8 8 8 6 6 6 6 6 6 6 6 6 6 1 1 1 1 1 1 1 1 1 1 1 1 1 1 1 1 1 1 1 1 1 1 1 1 1 1 1 1 1 1
symmnumber: 1
zpe: 1034908.9 jmol-1
zpe.correction: 0.394176 hartree
zpe.thermalcorrener: 0.425898 hartree
zpe.thermalcorrenthalpy: 0.426842 hartree
zpe.thermalcorrgfe: 0.331544 hartree
zpe.sumelectzpe: -2220.943286 hartree
zpe.sumelectthermal: -2220.911565 hartree
zpe.sumelectthermalent: -2220.910621 hartree
zpe.sumelectthermalfe: -2221.005918 hartree
dipole: 0.8181 0.6499 0.1508
dipole: 1.0557
quadrupole: -155.2944 -152.5048 -156.1178
quadrupole: -2.2567 -0.5182 0.6869
quadrupole: -0.6554 2.1342 -1.4788 -2.2567 -0.5182 0.6869
hfenergy: -2221.3374623 hartree
pointgroup: C01 [X(C10H30O5Si5)]
dipole: -0.2320588 -0.3361407 0.0751903 debye
polarizability: 235.5565311|-1.165519|233.8114987|1.2227381|-1.419356|217.4199141 unknown
InChI: InChI=1S/C10H30O5Si5/c1-16(2)11-17(3,4)13-19(7,8)15-20(9,10)14-18(5,6)12-16/h1-10H3
charge 0 multiplicity 1
50 atoms
Si 2.278022 1.298165 0.786879
Si 1.987402 -1.864238 -0.315144
Si -0.282733 2.441258 -0.915578
Si -1.311562 -2.510994 0.140784
Si -2.678936 0.540651 0.492094
O  2.346508 -0.258255 0.10177
O  1.221989 2.279798 -0.12811
O  0.337309 -2.187735 -0.087096
O  -1.453082 1.592844 -0.022165
O  -2.198817 -1.06698 0.225017
C  3.999639 2.067731 0.65314
C  1.616236 1.163044 2.561382
C  2.978661 -3.008309 0.830014
C  2.388985 -2.084308 -2.154949
C  -0.154431 1.679269 -2.649886
C  -0.727736 4.279945 -0.905985
C  -1.936382 -3.482291 -1.361908
C  -1.521686 -3.430048 1.788244
C  -2.930424 0.813052 2.351631
C  -4.238146 0.851247 -0.540983
H  4.326021 2.0715 -0.401441
H  3.992578 3.11134 1.014432
H  4.740217 1.497438 1.241951
H  0.575973 0.791421 2.54885
H  2.228902 0.466032 3.161502
H  1.620849 2.14872 3.06074
H  2.805552 -4.070567 0.578441
H  4.061562 -2.804305 0.746948
H  2.677731 -2.852143 1.881811
H  2.145305 -3.107246 -2.49491
H  1.801328 -1.370166 -2.759768
H  3.459766 -1.895988 -2.351591
H  0.07062 0.600476 -2.571207
H  0.654722 2.157954 -3.230492
H  -1.099686 1.79564 -3.210897
H  0.0602 4.876867 -1.398784
H  -0.82692 4.635851 0.134675
H  -1.684248 4.464057 -1.427621
H  -1.410007 -4.449238 -1.458549
H  -3.019716 -3.682425 -1.278837
H  -1.764964 -2.902374 -2.286069
H  -2.582005 -3.685732 1.965339
H  -0.932062 -4.364573 1.800195
H  -1.177386 -2.796545 2.62539
H  -3.679308 0.109902 2.758548
H  -1.980245 0.656503 2.893455
H  -3.272041 1.843811 2.556085
H  -5.062135 0.187738 -0.22221
H  -4.576761 1.898445 -0.440924
H  -4.034762 0.652357 -1.608312
