program: Gaussian 09
title: 000003769
version: EM64L-G09RevD.01
frameworkgroup: C1[X(C7H9N3O4S)]
method: RPBEPBE
basis: SDD
operation: Freq
keyword: #p
keyword: freq=noraman
keyword: PBEPBE/SDD
title: #p freq=noraman PBEPBE/SDD
converged: YES YES NO NO
title: Mulliken charges:
elementType: S O O O O N N N C C C C C C C H H H H H H H H H
charge: 0.990659 -0.678954 -0.559386 -0.708307 -0.324646 -0.070427 -0.357154 0.003889 -0.410820 0.289214 0.218185 -0.274882 -0.305142 -0.324488 -0.350458 0.358760 0.240703 0.364159 0.425129 0.271241 0.332993 0.246736 0.251909 0.371086
chargesum: 0.00000
title: Mulliken charges with hydrogens summed into heavy atoms:
elementType: S O O O O N N N C C C C C C C
charge: 0.990659 -0.307867 -0.559386 -0.283178 -0.324646 0.293733 -0.357154 0.003889 0.188643 0.289214 0.218185 -0.003641 0.027850 -0.077753 -0.098549
polarizability: 2.18527191e+02 -1.98769481e+01 1.72598582e+02 9.43571134e+00 3.93865334e+00 5.96473854e+01
1716.lowfreq: -19.0104 -4.7528 -1.0902 -0.0022 -0.0009 -0.0009 6.0527 25.5058 55.7455
frequency: -17.9855 25.2271 55.7301 71.7892 84.5210 115.8319 128.4384 146.2152 178.3113 207.6235 246.8080 256.6897 281.9047 309.7760 323.9736 339.0249 356.4334 369.5572 449.4902 467.1219 472.9833 536.8220 659.5538 668.1838 694.3594 708.8897 719.1910 754.5294 852.1194 883.6926 900.7771 904.6425 959.7916 989.4873 992.0073 1002.8568 1025.3059 1052.7162 1061.9330 1087.9844 1102.0439 1116.5421 1149.6410 1176.7367 1230.7772 1267.0860 1297.3539 1299.6737 1341.5505 1368.8092 1404.9599 1466.0246 1498.3565 1524.6585 1559.6271 1578.8262 1619.5557 1632.0880 2931.1447 3056.3466 3115.7487 3141.1211 3150.7254 3175.3503 3207.3330 3498.6460
redmass: 7.8783 7.3379 5.3788 5.7948 7.7936 8.6902 5.9066 6.3139 7.3726 5.8659 3.6856 2.2383 4.8117 2.8284 6.4916 3.8924 3.2670 2.5722 8.0564 7.0737 6.3872 3.9842 6.9513 7.8249 2.8734 12.3593 1.6247 3.1858 1.5403 4.6021 4.9649 1.2662 6.9568 1.4272 1.4605 1.3794 2.5302 1.3431 2.0628 1.2334 1.7879 2.9619 1.1122 1.2419 1.2744 2.0808 3.8196 8.9792 1.3717 1.4733 1.8770 1.8239 1.2539 3.7979 5.2725 3.3883 1.5162 2.9268 1.0815 1.0806 1.0945 1.0893 1.0953 1.0964 1.1068 1.0663
irintensity: 2.3820 1.6179 2.0171 1.8626 2.2268 0.4017 13.1947 47.7752 18.3209 2.9628 19.6187 25.4426 28.4224 18.2130 30.9920 50.9819 483.1788 23.8688 22.9804 54.3246 37.8742 14.8366 2.7784 8.6331 43.0690 169.6636 4.5079 13.3179 35.4193 393.1343 3.6528 0.7457 3.4258 1.2203 89.5075 23.5124 6.3292 25.5283 97.1360 221.5174 4.4069 105.0396 746.6906 1898.8829 26.6501 77.4134 304.7285 16.4622 21.5651 471.9769 87.3214 33.8178 183.4893 19.7017 10.4075 47.9103 194.6788 150.9178 372.1760 115.5361 81.4390 18.6756 10.6794 8.4798 15.8949 26.3031
temp: 298.150 k
press: 1.00000 atm
elementType: 16 8 8 8 8 7 7 7 6 6 6 6 6 6 6 1 1 1 1 1 1 1 1 1
symmnumber: 1
zpe: 426187.7 jmol-1
zpe.correction: 0.162326 hartree
zpe.thermalcorrener: 0.177212 hartree
zpe.thermalcorrenthalpy: 0.178157 hartree
zpe.thermalcorrgfe: 0.118830 hartree
zpe.sumelectzpe: -1134.092475 hartree
zpe.sumelectthermal: -1134.077589 hartree
zpe.sumelectthermalent: -1134.076645 hartree
zpe.sumelectthermalfe: -1134.135972 hartree
dipole: -1.4684 6.5326 0.5132
dipole: 6.7152
quadrupole: -103.8850 -95.0219 -93.8025
quadrupole: -10.7406 1.4414 -2.9521
quadrupole: -6.3152 2.5479 3.7673 -10.7406 1.4414 -2.9521
hfenergy: -1134.2548014 hartree
pointgroup: C01 [X(C7H9N3O4S1)]
dipole: -1.1901185 0.3806534 -2.3278172 debye
dipolederiv: 1.4864826 0.2449113 -0.3291447 0.181694 0.7351015 0.07654 -0.3390015 0.1162497 1.4284212 -0.9266372 -0.0554982 -0.0474427 -0.2074199 -0.4414782 -0.3177351 -0.0618559 -0.1133522 -0.8098154 -0.4374641 0.0156308 0.1000529 -0.1706093 -0.4170777 0.3548965 0.2357136 -0.1109875 -0.7856378 -1.2397544 -0.3124116 0.7218505 0.0282812 -0.5396239 -0.0332906 0.9052059 0.220264 -1.3141517 -0.8347059 -0.0582875 -0.061264 -0.1206284 -0.3850444 0.1232065 0.3493444 0.1773387 -1.0315471 0.5392951 0.0371471 0.4058774 -0.1046431 -0.0216953 0.037289 1.0293706 0.1356635 0.1474062 -1.854597 -0.2674875 0.0754829 -0.1896075 -0.2800648 0.0692255 -0.1530207 0.0616578 -0.8907675 -0.3682572 -0.008156 -0.0420522 -0.0077325 -0.2433641 -0.0117797 -0.0551043 -0.0108087 -0.2248828 -0.4426902 -0.0058404 -0.1659832 -0.0209331 -0.1989086 -0.0533338 -0.000323 -0.0440754 0.0803228 -0.327414 0.0138706 -0.2819895 0.020222 0.0160677 -0.0274525 -0.3362808 -0.0364168 -0.1396605 2.3221735 0.2805561 0.2221441 0.3410907 0.2651482 -0.1202835 -0.1934738 -0.1810497 0.9927 -0.1348246 -0.0670924 0.1926862 0.0149669 -0.0607029 0.0247048 -0.1832087 -0.0539553 -0.0090847 -0.1274974 0.0389388 -0.1689061 -0.0222837 -0.0633617 -0.0042837 0.1168701 0.0533872 -0.1442197 0.3987508 0.1461993 -0.1784452 0.1096386 -0.0403543 -0.0435712 -0.0437272 -0.0135679 -0.0581184 -0.0549716 -0.0337011 0.1521508 -0.0120946 -0.0421044 -0.0904322 0.0471249 -0.1235043 0.3684006 0.2152894 0.020968 -0.1816124 0.0296028 0.2265923 -0.0953854 -0.2454387 -0.0854948 0.4176938 0.1016116 -0.0194216 0.0040676 -0.0089981 0.1873751 0.0349486 -0.0278016 0.0323315 -0.0147395 0.4435179 0.0017529 0.1055384 0.0377152 0.2912799 0.0354085 -0.1129719 -0.0017595 0.1693607 0.4396924 0.1183544 -0.4767295 0.2099164 0.352903 -0.2085097 -0.9968857 -0.2705963 1.5761371 0.1509814 -0.000206 -0.0040038 -0.0051538 0.1415833 0.0399211 0.0439513 0.050108 0.00866 0.2750044 0.0064672 -0.0607043 -0.0258033 0.1572688 0.0094748 0.0094867 0.0149333 0.1203631 -0.0814886 -0.063931 0.0675445 -0.0605297 0.1150292 0.0365749 0.0586547 0.0337663 0.0580414 0.0795713 -0.0163044 0.016818 -0.0170757 0.1148937 0.0605186 0.0079065 0.0607197 -0.0720597 0.377932 -0.0164588 -0.0659356 0.000385 0.1305376 0.1033488 -0.054535 0.0891487 0.1271776 unknown
polarizability: 220.0665719|28.2332372|68.1997396|11.874716|-19.1868016|162.5068467 unknown
InChI: InChI=1S/C7H9N3O4S/c1-8-10(16-14-15(12)13)7(11)6-2-4-9-5-3-6/h2-5,8,12H,1H2
charge 0 multiplicity 1
24 atoms
S  -2.824365 -0.353577 2.168817
O  -3.906891 -1.136785 0.754469
O  -2.941431 -1.384736 3.40024
O  -1.25599 -0.640284 1.476555
O  0.881089 0.352514 -2.611955
N  -1.487943 -0.16231 -1.946719
N  -0.602237 -0.181916 -0.891225
N  4.099637 0.089668 1.334448
C  -2.778014 -0.405299 -1.910607
C  1.82756 0.085223 -0.388665
C  0.70282 0.100108 -1.365372
C  3.105466 0.480854 -0.865987
C  1.704587 -0.3139 0.96829
C  4.198986 0.469084 0.022968
C  2.864338 -0.292806 1.776937
H  -3.284471 -0.679623 -0.965676
H  -3.314534 -0.337283 -2.860447
H  -0.960236 0.08276 -2.829306
H  -1.040286 -0.395889 0.358012
H  3.221861 0.784505 -1.910222
H  0.750545 -0.632344 1.403921
H  5.197559 0.770372 -0.311471
H  2.808501 -0.595544 2.827999
H  -4.08565 -2.07539 1.047696
