program: Gaussian 09
title: 000097693
version: EM64L-G09RevD.01
frameworkgroup: C1[X(C10H12N6O4)]
method: RPBEPBE
basis: SDD
operation: Freq
keyword: #p
keyword: freq=noraman
keyword: PBEPBE/SDD
title: #p freq=noraman PBEPBE/SDD
converged: YES YES NO NO
title: Mulliken charges:
elementType: O O O O N N N N N N C C C C C C C C C C H H H H H H H H H H H H
charge: -0.461136 -0.375645 -0.257108 -0.219274 -0.407112 -0.493793 -0.400181 0.003691 -0.016690 0.045373 -0.168358 -0.095137 -0.683958 0.213867 0.282352 0.092576 0.224672 -0.082620 -0.218008 -0.385647 0.289608 0.218593 0.322142 0.216076 0.245139 0.221052 0.298486 0.371041 0.313029 0.266835 0.251821 0.388312
chargesum: 0.00000
title: Mulliken charges with hydrogens summed into heavy atoms:
elementType: O O O O N N N N N N C C C C C C C C C C
charge: -0.090095 0.012668 -0.257108 -0.219274 -0.084970 -0.195307 -0.087152 0.003691 -0.016690 0.045373 0.121250 0.123456 -0.001691 0.213867 0.282352 0.092576 0.224672 -0.082620 0.048828 -0.133826
polarizability: 2.23421887e+02 -7.13022173e+00 1.76941441e+02 -6.75723933e-01 4.18561569e+00 1.02913763e+02
1716.lowfreq: -6.0697 -4.7885 0.0007 0.0010 0.0011 3.8464 11.7011 24.4643 27.7530
frequency: 8.8839 24.3604 27.7297 46.5252 60.5272 92.8833 102.6460 122.6296 145.1956 182.6290 192.2818 216.5084 238.9130 258.7535 272.5125 295.3819 316.1998 333.3614 382.9287 420.4461 441.2385 492.8641 535.3780 552.4517 567.3669 577.6053 593.0260 608.5677 614.1073 631.2139 643.3734 657.2263 683.0404 692.7704 703.4419 724.3863 787.8470 803.9539 830.5290 840.7105 851.9765 878.1897 901.0252 929.5049 931.0751 958.6218 1005.0567 1046.5053 1067.9861 1073.8781 1079.9600 1100.3950 1115.9890 1140.5736 1196.4582 1226.0908 1233.2800 1259.2778 1267.8005 1277.0101 1297.5124 1318.7543 1323.2965 1334.6664 1352.1646 1369.8248 1381.2997 1399.3876 1415.9252 1423.1970 1458.4031 1462.0436 1465.9869 1473.4183 1517.3211 1596.2064 1622.4534 1666.4373 2973.4411 3000.0377 3086.0094 3099.7187 3108.9145 3173.4246 3234.7524 3434.1638 3490.4531 3494.2952 3535.5777 3586.2761
redmass: 6.1649 6.5403 8.1214 6.9873 7.0449 6.5626 4.9251 4.6235 5.4745 3.8871 1.2145 6.1179 5.6378 6.8563 4.6617 6.0966 4.5102 6.2755 5.1556 1.2282 3.1278 6.5912 7.9294 1.3384 2.8005 1.9211 2.3270 2.3275 2.3475 2.4724 1.8960 3.6661 2.2682 8.5424 5.9084 4.2152 7.3197 5.8602 3.2491 1.6407 6.3059 3.6250 7.5397 1.8202 2.2507 3.7596 2.3189 2.7815 2.0332 2.2237 2.7910 1.9855 3.1166 3.2346 1.9295 2.1247 1.6251 6.0711 1.3080 1.3645 3.9263 1.9426 1.4518 5.3408 2.1034 1.8639 1.2840 1.5314 2.1968 2.2354 1.5678 1.2671 2.1587 1.0590 7.8665 7.8909 7.5867 7.3717 1.0853 1.0360 1.0863 1.0994 1.1000 1.0923 1.0990 1.0653 1.0640 1.0774 1.0767 1.0820
irintensity: 4.7745 0.1000 4.6774 2.9501 0.7367 7.3724 13.3988 0.2879 2.0453 3.4145 2.5363 1.5145 0.4482 3.1830 1.0881 10.2868 7.5095 3.0144 12.6315 113.4261 26.9730 6.7704 4.7623 67.6922 35.1380 105.0187 73.4567 7.9959 37.7746 65.3930 264.4962 26.6039 102.0180 3.6918 38.9361 56.4947 6.7642 3.5270 24.6665 15.1836 3.4544 5.5022 3.2977 2.1444 30.4736 6.3904 12.6582 78.0608 115.4855 90.6577 34.0412 53.3403 50.2079 45.7506 127.3987 32.5620 98.3174 2.3956 84.1588 104.6892 69.9643 5.7677 9.6371 97.6349 149.2816 71.6350 21.7932 86.5908 154.4640 45.9471 215.0461 21.0039 534.6568 29.7910 61.7055 235.8074 199.3614 228.9784 51.4254 13.9806 5.3738 30.6774 22.2816 14.6125 0.9251 50.3103 28.2848 73.3899 15.0925 40.4825
temp: 298.150 k
press: 1.00000 atm
elementType: 8 8 8 8 7 7 7 7 7 7 6 6 6 6 6 6 6 6 6 6 1 1 1 1 1 1 1 1 1 1 1 1
symmnumber: 1
zpe: 618220.6 jmol-1
zpe.correction: 0.235468 hartree
zpe.thermalcorrener: 0.254040 hartree
zpe.thermalcorrenthalpy: 0.254984 hartree
zpe.thermalcorrgfe: 0.185004 hartree
zpe.sumelectzpe: -1016.209077 hartree
zpe.sumelectthermal: -1016.190504 hartree
zpe.sumelectthermalent: -1016.189560 hartree
zpe.sumelectthermalfe: -1016.259540 hartree
dipole: 5.1914 5.8664 0.5057
dipole: 7.8499
quadrupole: -135.1268 -100.6281 -123.3148
quadrupole: -24.9476 -5.8780 -4.4625
quadrupole: -15.4369 19.0618 -3.6249 -24.9476 -5.8780 -4.4625
hfenergy: -1016.4445443 hartree
pointgroup: C01 [X(C10H12N6O4)]
dipole: 2.0797411 2.2508804 -0.3826598 debye
polarizability: 223.0488502|-8.4498864|175.3667231|-2.6753896|-12.1892625|104.8615184 unknown
InChI: InChI=1S/C10H12N6O4/c1-4(17)5(9(18)19)15-10(20)16-8-6-7(12-2-11-6)13-3-14-8/h2-5,11,15-18H,1H3
charge 0 multiplicity 1
32 atoms
O  4.144961 1.781893 0.769126
O  3.970829 -2.426546 -0.215063
O  4.260227 -0.964633 1.562208
O  0.726896 -1.241101 -1.280332
N  1.959956 0.311579 -0.041184
N  -0.375274 0.405603 0.027522
N  -3.18309 1.874276 -0.294515
N  -1.733875 -1.505143 0.49925
N  -5.167585 0.802661 0.122317
N  -4.187592 -1.426933 0.613192
C  3.265501 -0.118443 -0.540012
C  4.229156 1.113741 -0.545096
C  3.85567 2.150936 -1.604001
C  3.866083 -1.188803 0.387028
C  0.775282 -0.273252 -0.482432
C  -2.843644 0.558945 0.045664
C  -1.645525 -0.187789 0.176813
C  -4.097583 -0.101572 0.294466
C  -4.582583 1.955017 -0.230023
C  -2.981099 -2.05361 0.676478
H  3.139772 -0.552334 -1.544638
H  5.263732 0.748637 -0.71753
H  1.996339 0.998832 0.71877
H  3.979073 1.735314 -2.619507
H  4.508263 3.033518 -1.499813
H  2.808422 2.476001 -1.48035
H  -0.266013 1.376325 0.32781
H  4.426029 1.118583 1.461712
H  -2.555919 2.617317 -0.599166
H  -5.11597 2.877491 -0.451541
H  -2.996282 -3.121372 0.911611
H  4.344642 -3.095736 0.422936
