program: Gaussian 09
title: 000000624
version: EM64L-G09RevD.01
frameworkgroup: C1[X(C9H14N3O7P)]
method: RPBEPBE
basis: SDD
operation: Freq
keyword: #p
keyword: freq=noraman
keyword: PBEPBE/SDD
title: #p freq=noraman PBEPBE/SDD
converged: YES YES NO NO
title: Mulliken charges:
elementType: P O O O O O O O N N N C C C C C C C C C H H H H H H H H H H H H H H
charge: 1.387159 -0.299986 -0.451925 -0.529471 -0.276553 -0.674872 -0.681705 -0.583912 -0.212268 -0.049091 -0.623472 -0.154314 -0.016950 -0.543363 0.017105 -0.283807 -0.085754 0.055715 -0.348450 0.187086 0.237934 0.241403 0.300497 0.238238 0.281559 0.270394 0.255795 0.354115 0.298151 0.232366 0.317539 0.339361 0.397504 0.403972
chargesum: 0.00000
title: Mulliken charges with hydrogens summed into heavy atoms:
elementType: P O O O O O O O N N N C C C C C C C C C
charge: 1.387159 -0.299986 -0.097810 -0.529471 -0.276553 -0.277368 -0.277733 -0.583912 -0.212268 -0.049091 0.033429 0.083620 0.224453 -0.004628 0.298664 0.242381 0.212397 0.055715 -0.116083 0.187086
polarizability: 2.08353998e+02 1.75048097e+01 1.84063701e+02 -1.76754116e+00 1.45160384e+01 1.09691311e+02
1716.lowfreq: -5.5819 -0.0022 -0.0010 0.0012 3.4049 6.1979 7.2324 17.6064 27.0465
frequency: 6.8630 17.4587 27.0173 47.8851 54.0639 80.9922 92.6299 120.2672 141.3893 150.7853 181.5358 189.9577 207.3540 213.4353 236.1429 256.5145 284.2401 301.2037 324.8858 343.6522 347.1530 358.2916 373.3549 383.2472 406.5557 425.3996 432.2393 450.5479 514.3356 529.4054 562.6572 566.6994 591.1126 632.1774 641.9439 695.9648 723.0448 727.6996 734.0940 746.4934 766.3971 777.7258 798.3933 810.6189 847.6526 913.9974 923.6324 925.8141 952.6645 971.8087 978.9660 1005.6686 1014.7916 1016.3664 1034.8512 1048.0514 1063.3887 1085.4708 1090.9556 1123.9089 1151.9890 1173.4690 1178.4311 1203.3382 1205.3563 1251.6890 1258.1732 1270.9470 1294.5467 1310.8860 1317.9404 1335.2654 1359.9555 1377.3964 1383.1808 1451.3310 1462.3264 1472.9726 1504.9072 1586.3900 1627.2315 1638.2488 2990.4865 3006.5297 3029.2070 3035.4963 3049.8263 3111.6211 3116.7012 3171.7551 3192.3415 3542.4343 3580.5175 3594.8055 3611.9570 3700.4124
redmass: 6.8553 7.0839 7.2005 5.5758 5.7707 5.5948 6.1778 4.5311 4.1059 2.5285 2.3229 5.3477 5.5562 5.3795 3.4718 4.6657 1.1536 2.8584 4.1738 5.3056 4.7671 2.6337 3.1807 3.1990 4.6175 3.0276 1.1759 3.0870 4.0670 4.1148 7.1344 1.2272 5.8256 7.4056 4.9713 3.0435 9.0190 8.6946 7.4639 6.3683 5.9569 1.7697 3.7824 4.6239 3.2924 3.1285 4.0691 2.3083 4.6367 1.3105 1.9977 1.3118 2.2298 1.2492 2.7196 2.7447 2.3266 2.7235 6.6341 2.2005 1.3246 1.8746 1.3949 1.1316 4.2185 1.3176 1.3123 1.4123 1.4343 1.3469 1.2469 1.6737 1.4753 1.6741 1.8096 1.0885 1.1279 4.2206 4.7772 2.5950 1.9040 7.8498 1.0843 1.0842 1.0695 1.0577 1.0857 1.1003 1.1082 1.0888 1.1000 1.0452 1.0664 1.0662 1.0664 1.1045
irintensity: 2.4667 1.4232 6.5758 3.8512 4.8894 1.8112 1.7127 11.5871 15.2577 43.3849 31.9184 7.3131 9.9168 13.7534 31.2320 15.4578 143.2411 22.4722 30.2178 36.6492 11.0275 80.2628 28.1680 117.9095 18.0963 1.3406 156.8249 8.2675 0.5412 13.2281 11.2211 129.5807 4.9080 16.2832 18.2957 0.4097 227.3617 160.6634 38.3959 19.8714 29.2065 82.6701 13.0674 20.5323 11.0840 42.5749 108.4624 24.0767 216.3725 3.1582 17.2496 26.7786 36.5464 132.4165 42.8780 31.8099 85.9725 37.6499 235.1974 45.6265 50.7737 26.9277 9.0721 1.7562 13.1815 39.1286 55.4714 35.9692 37.6831 4.2907 0.4039 86.0047 3.2571 16.7062 11.1959 15.5092 21.5132 169.9064 115.4255 165.7279 209.8059 752.4550 12.2405 39.6885 23.1630 15.4402 11.0388 6.2091 8.6903 1.6509 7.0932 110.3625 11.2141 60.4705 71.8480 37.7442
temp: 298.150 k
press: 1.00000 atm
elementType: 15 8 8 8 8 8 8 8 7 7 7 6 6 6 6 6 6 6 6 6 1 1 1 1 1 1 1 1 1 1 1 1 1 1
symmnumber: 1
zpe: 650899.4 jmol-1
zpe.correction: 0.247914 hartree
zpe.thermalcorrener: 0.268922 hartree
zpe.thermalcorrenthalpy: 0.269866 hartree
zpe.thermalcorrgfe: 0.194548 hartree
zpe.sumelectzpe: -1381.857960 hartree
zpe.sumelectthermal: -1381.836952 hartree
zpe.sumelectthermalent: -1381.836008 hartree
zpe.sumelectthermalfe: -1381.911326 hartree
dipole: -0.0152 -0.7524 -1.4286
dipole: 1.6146
quadrupole: -125.4972 -112.3544 -123.0243
quadrupole: 35.8537 21.1863 -10.4764
quadrupole: -5.2052 7.9376 -2.7323 35.8537 21.1863 -10.4764
hfenergy: -1382.1058745 hartree
pointgroup: C01 [X(C9H14N3O7P1)]
dipole: -0.020865 -0.3086841 -0.5548152 debye
polarizability: 209.1994262|16.965071|183.7916135|-3.04858|12.6259768|109.1179708 unknown
InChI: InChI=1S/C9H14N3O7P/c10-7-1-2-12(9(14)11-7)8-3-5(13)6(19-8)4-18-20(15,16)17/h1-2,5-6,8,13,15-16H,3-4,10H2
charge 0 multiplicity 1
34 atoms
P  4.632255 -1.232425 -0.074673
O  0.457175 0.188333 0.039215
O  1.420567 3.097654 0.053912
O  3.219867 -0.588424 -0.772037
O  -3.241882 1.869788 0.844632
O  4.515603 -1.006074 1.642296
O  5.731896 0.042093 -0.404547
O  4.958087 -2.704502 -0.545165
N  -1.94688 0.083493 0.070303
N  -4.346448 -0.151027 0.337999
N  -5.389924 -2.153345 -0.194407
C  0.794194 2.326189 -1.03271
C  1.34658 0.88953 -0.934456
C  -0.715594 2.121743 -0.807698
C  -0.763722 0.977249 0.234946
C  2.784835 0.804457 -0.450748
C  -1.838219 -1.212676 -0.375437
C  -3.235059 0.664908 0.449621
C  -2.962135 -2.010844 -0.495225
C  -4.226921 -1.420846 -0.114365
H  1.022184 2.783823 -2.015734
H  1.261708 0.382995 -1.916262
H  -1.244455 3.01633 -0.445057
H  -1.198372 1.791938 -1.745937
H  -0.79077 1.369259 1.266004
H  2.845984 0.993592 0.632859
H  3.43481 1.511493 -0.993477
H  0.955493 3.965637 0.150111
H  -0.825426 -1.554828 -0.601334
H  -2.877848 -3.041468 -0.84461
H  -5.398637 -3.116446 -0.517798
H  -6.256015 -1.700404 0.093189
H  4.127164 -1.775988 2.130912
H  6.586907 0.010393 0.092776
