program: Gaussian 09
title: 000097593
version: EM64L-G09RevD.01
frameworkgroup: C1[X(C9H14NO4P)]
method: RPBEPBE
basis: SDD
operation: Freq
keyword: #p
keyword: freq=noraman
keyword: PBEPBE/SDD
title: #p freq=noraman PBEPBE/SDD
converged: YES YES NO NO
title: Mulliken charges:
elementType: P O O O O N C C C C C C C C C H H H H H H H H H H H H H H
charge: 1.241891 -0.671877 -0.679162 -0.433468 -0.623901 -0.007651 -0.522635 0.444321 -0.792915 0.188006 0.058604 -0.570646 0.006656 -0.823810 -0.818931 0.256380 0.243855 0.298935 0.304278 0.256407 0.273985 0.234834 0.241767 0.230173 0.281000 0.227334 0.390515 0.390694 0.375359
chargesum: 0.00000
title: Mulliken charges with hydrogens summed into heavy atoms:
elementType: P O O O O N C C C C C C C C C
charge: 1.241891 -0.281362 -0.288468 -0.058108 -0.623901 -0.007651 -0.022400 0.444321 -0.189702 0.188006 0.058604 -0.314239 0.006656 -0.073224 -0.080423
polarizability: 1.93989131e+02 -1.69470118e+00 1.36558810e+02 -1.29093700e+01 2.08599171e+00 9.59848648e+01
1716.lowfreq: -0.0020 -0.0016 -0.0013 4.5301 6.4255 14.3777 22.8691 30.5917 47.5731
frequency: 22.6037 30.5309 47.4920 60.1475 85.6576 110.5260 124.3140 143.6112 150.2562 168.0483 221.3045 270.1807 284.0129 287.2503 293.4383 312.9661 321.9835 327.9288 338.5504 358.3832 377.6648 389.5600 494.8112 507.1752 516.8581 549.0385 600.4168 629.7838 657.7763 718.8827 733.1517 750.1904 773.6804 791.1777 871.1115 907.7255 924.9700 973.3588 983.8095 989.7640 1018.3723 1022.6020 1037.8515 1042.2316 1073.0125 1096.4641 1153.9324 1191.2940 1218.2499 1255.5262 1268.2268 1282.6599 1298.6423 1343.9449 1345.8119 1385.2641 1395.4123 1406.5976 1423.9397 1451.8631 1459.7914 1477.6485 1478.5086 1481.8549 1493.0139 1555.0678 1596.8692 2956.6726 2984.2051 3010.7501 3028.1367 3039.7544 3061.2925 3069.3225 3111.3424 3113.4304 3118.0516 3118.4920 3582.7195 3590.5974 3597.2997
redmass: 6.5331 5.3022 3.8733 1.0837 3.8940 5.3847 3.1161 2.6162 1.2366 1.9008 3.9433 3.0046 2.6061 2.7937 3.4783 2.7077 3.0470 1.2573 3.2653 2.4166 1.9910 3.3184 6.3097 5.3363 2.8968 5.0330 5.1579 6.4858 5.8559 7.7694 5.0214 4.1116 1.4731 2.9374 3.3538 1.5301 1.9202 1.9601 1.2744 1.6170 1.7531 2.5287 1.7262 1.5298 2.1800 2.8612 1.2846 2.1214 2.4180 3.8729 1.2426 1.3925 1.4973 3.2152 1.4475 1.6965 1.5973 1.7259 1.0793 1.4433 1.1238 1.0778 1.4269 1.2179 1.0813 6.2882 6.4659 1.0402 1.0415 1.0609 1.0980 1.0587 1.0944 1.1010 1.1044 1.0942 1.0945 1.0946 1.0654 1.0660 1.0662
irintensity: 0.1225 0.0398 0.1811 0.2546 0.3656 4.6914 0.1612 7.2749 4.1050 3.0333 1.7421 12.0947 2.5532 9.3417 18.8379 14.4450 22.5369 170.1502 104.7524 123.7505 39.1467 19.8831 7.0011 3.9913 9.4091 2.0165 6.3092 22.9204 71.1752 224.6685 57.0427 11.4765 16.5589 54.0602 21.9141 13.4254 8.2666 2.0675 37.9882 2.9824 17.2639 10.4837 12.0068 1.7618 176.2298 9.6200 107.1415 132.4598 8.0148 0.5920 19.4079 1.6010 2.5352 3.3680 0.8393 65.1636 30.8851 36.2350 7.2899 9.3687 29.8619 14.3947 25.9361 17.7822 3.6874 12.8268 9.6985 30.5881 15.4835 11.4281 22.7702 4.4421 16.5629 4.8376 1.6023 3.8540 2.3228 22.0312 44.4450 55.0534 44.2090
temp: 298.150 k
press: 1.00000 atm
elementType: 15 8 8 8 8 7 6 6 6 6 6 6 6 6 6 1 1 1 1 1 1 1 1 1 1 1 1 1 1
symmnumber: 1
zpe: 584596.0 jmol-1
zpe.correction: 0.222661 hartree
zpe.thermalcorrener: 0.240253 hartree
zpe.thermalcorrenthalpy: 0.241197 hartree
zpe.thermalcorrgfe: 0.175791 hartree
zpe.sumelectzpe: -1047.082100 hartree
zpe.sumelectthermal: -1047.064508 hartree
zpe.sumelectthermalent: -1047.063564 hartree
zpe.sumelectthermalfe: -1047.128970 hartree
dipole: -1.0508 2.5327 0.7837
dipole: 2.8518
quadrupole: -77.7824 -105.4313 -98.3421
quadrupole: 2.9326 0.4481 -5.4385
quadrupole: 16.0695 -11.5793 -4.4901 2.9326 0.4481 -5.4385
hfenergy: -1047.3047612 hartree
pointgroup: C01 [X(C9H14N1O4P1)]
dipole: 0.4125992 -1.0075624 0.2710302 debye
polarizability: 194.1303645|-2.2860569|136.665479|12.2457713|-0.6887882|95.7369629 unknown
InChI: InChI=1S/C9H14NO4P/c1-6-8(3-4-15(12,13)14)5-10-7(2)9(6)11/h5,11-13H,3-4H2,1-2H3
charge 0 multiplicity 1
29 atoms
P  -3.738306 0.117354 0.182683
O  -4.341343 -0.075786 1.799997
O  -3.787039 -1.470106 -0.527763
O  3.306251 -1.838793 0.278548
O  -4.513067 1.220359 -0.671228
N  2.363264 1.743795 -0.03209
C  -1.081592 0.272568 -0.791207
C  0.403276 0.329944 -0.468984
C  -1.920444 0.251017 0.513543
C  1.168661 -0.851973 -0.252351
C  2.538453 -0.676177 0.073269
C  1.048096 1.585855 -0.35105
C  3.111321 0.623239 0.184288
C  0.58641 -2.244856 -0.386064
C  4.573201 0.809559 0.539981
H  -1.320159 -0.623535 -1.390455
H  -1.36865 1.155024 -1.39282
H  -1.659227 -0.607221 1.155128
H  -1.771948 1.172477 1.101455
H  0.486645 2.511622 -0.527012
H  1.273358 -2.994447 0.034451
H  -0.390617 -2.33641 0.120072
H  0.4227 -2.501018 -1.450829
H  5.250387 0.358345 -0.213359
H  4.785219 1.888767 0.577867
H  4.82439 0.380316 1.531289
H  -5.286515 0.199784 1.914957
H  -4.594761 -1.648582 -1.073004
H  4.237234 -1.60202 0.515488
