program: Gaussian 09
title: 000097582
version: EM64L-G09RevD.01
frameworkgroup: C1[X(C8H5BrO2S)]
method: RPBEPBE
basis: SDD
operation: Freq
keyword: #p
keyword: freq=noraman
keyword: PBEPBE/SDD
title: #p freq=noraman PBEPBE/SDD
converged: NO NO NO NO
title: Mulliken charges:
elementType: Br S O O C C C C C C C C H H H H H
charge: 0.068950 0.824128 -0.516533 -0.516532 -0.196686 0.590370 -0.405761 -0.155940 -0.258773 -0.336013 -0.220012 -0.209403 0.300327 0.276183 0.262803 0.249148 0.243745
chargesum: 0.00000
title: Mulliken charges with hydrogens summed into heavy atoms:
elementType: Br S O O C C C C C C C C
charge: 0.068950 0.824128 -0.516533 -0.516532 -0.196686 0.590370 -0.105434 -0.155940 0.017410 -0.073211 0.029136 0.034342
polarizability: 1.70907607e+02 6.87301010e+00 1.57958987e+02 -2.68669089e-03 -2.43884802e-04 6.84074931e+01
1716.lowfreq: -9.8186 -8.5094 -0.0014 -0.0004 0.0013 1.9986 69.3156 92.3164 115.9078
frequency: 69.2808 92.2587 115.9016 141.5739 166.7970 228.8028 235.1792 305.0090 319.2943 401.2324 403.8812 448.2121 478.3781 508.8308 585.4857 587.0670 649.7089 702.5349 722.7575 755.8556 775.5072 812.0055 881.0187 884.0713 937.8139 958.6470 997.6179 1000.7266 1020.6196 1081.0044 1121.7164 1176.2657 1235.2436 1270.5891 1393.4684 1429.7020 1443.0347 1553.3982 1586.3463 1607.7064 3147.5005 3158.0019 3168.4927 3180.5756 3251.3388
redmass: 12.6451 6.9213 5.2591 9.0409 11.2528 17.5241 4.3764 8.3405 10.3306 10.2949 3.1208 8.7322 4.0704 6.9755 7.6260 3.6729 6.7546 6.9899 2.8705 1.4891 1.3739 12.6465 1.3576 5.2991 18.5352 1.4007 5.6988 1.3504 2.1781 1.3992 1.4820 1.0736 2.8195 1.5263 6.2946 2.5969 2.3711 6.9531 7.6564 7.5655 1.0865 1.0903 1.0951 1.1007 1.1015
irintensity: 1.6002 1.0441 0.8300 0.7129 5.9354 4.6906 4.0982 4.3626 31.3738 32.8233 7.2662 15.6044 5.2769 0.3752 4.8943 0.0077 1.5044 43.1560 22.1925 24.8601 77.5623 104.4451 3.0276 43.1564 95.8853 2.0426 0.3309 0.2196 0.9198 19.4290 2.3940 3.2216 82.2897 4.0180 0.8181 13.7224 3.5092 40.8600 17.4341 12.4890 1.4175 3.1507 1.9508 15.0085 21.4617
temp: 298.150 k
press: 1.00000 atm
elementType: 35 16 8 8 6 6 6 6 6 6 6 6 1 1 1 1 1
symmnumber: 1
zpe: 281065.3 jmol-1
zpe.correction: 0.107052 hartree
zpe.thermalcorrener: 0.117957 hartree
zpe.thermalcorrenthalpy: 0.118901 hartree
zpe.thermalcorrgfe: 0.068979 hartree
zpe.sumelectzpe: -868.772621 hartree
zpe.sumelectthermal: -868.761716 hartree
zpe.sumelectthermalent: -868.760772 hartree
zpe.sumelectthermalfe: -868.810694 hartree
dipole: 2.9175 5.3474 0.0000
dipole: 6.0916
quadrupole: -88.0168 -77.5039 -96.7059
quadrupole: -15.1148 -0.0008 0.0008
quadrupole: -0.6079 9.9050 -9.2970 -15.1148 -0.0008 0.0008
hfenergy: -868.8796727 hartree
pointgroup: C01 [X(C8H5Br1O2S1)]
dipole: 2.0120268 -1.3020925 -0.0000193 debye
dipolederiv: -0.0362933 0.0624731 0.0000008 -0.0388825 -0.8608543 -0.000023 -0.0000003 -0.0000456 0.0412445 1.2478227 0.0035407 -0.0000318 -0.4699302 1.4655565 -0.0000119 -0.0000494 -0.0000058 1.295132 -0.5537048 0.0275927 0.0177666 0.135521 -0.5905853 -0.0241395 0.1309058 -0.156019 -0.6001668 -0.5536984 0.0275589 -0.0177422 0.1355206 -0.5906264 0.0241511 -0.1308736 0.1560254 -0.6001559 -0.0082782 -0.0925247 0.0000098 0.0738096 -0.0532603 0.0000029 0.0000192 0.0000119 -0.2344994 -0.1333737 0.0152361 -0.0000033 -0.1658558 -0.4324358 -0.0000126 0.0000005 -0.0000372 0.085283 -0.3878148 0.0956322 0.0000056 0.1352293 -0.5814089 -0.0000028 -0.0000066 -0.00002 -0.3166555 0.296897 -0.153949 0.0000097 0.1764637 1.3963838 0.0000369 -0.0000088 0.0001007 -0.0950058 -0.2774324 -0.0677606 -0.0000088 0.1262882 0.063981 0.0000053 0.0000039 0.0000064 -0.0505718 -0.066608 0.0487175 -0.000005 -0.0056309 0.1081049 0.0000061 0.0000073 0.0000126 -0.1148785 0.0875722 0.1108482 0.0000015 -0.0434434 0.020573 0.0000014 -0.0000028 0.0000195 -0.1291176 0.1710715 -0.0827128 -0.0000058 -0.0593378 -0.0707336 0.0000022 -0.0000055 -0.0000195 -0.1232485 0.1332241 -0.0015967 -0.0000002 -0.0196765 0.0311853 -0.0000039 0.0000081 -0.0000091 0.2096365 0.0973928 0.0434447 0.0000018 -0.0010253 0.0139407 -0.0000045 -0.0000031 -0.0000161 0.1500696 0.0924363 -0.0022107 0.0000005 0.0353257 -0.0234218 -0.0000007 0.0000052 0.0000018 0.1615253 -0.034811 -0.0816161 -0.0000014 -0.0772013 0.0307442 -0.0000032 0.0000008 0. 0.1635734 -0.0744021 0.0473266 0.0000022 0.0628255 0.0728569 -0.0000037 -0.0000005 -0.000006 0.1578354 unknown
polarizability: 157.0055686|-5.8295633|171.8610255|-0.0000421|0.0026974|68.4074931 unknown
InChI: InChI=1S/C8H5BrO2S/c9-7-5-12(10,11)8-4-2-1-3-6(7)8/h1-5H
charge 0 multiplicity 1
17 atoms
Br -0.805506 -3.423114 -0.000133
S  -1.610079 1.102404 -0.000031
O  -2.067211 1.791529 1.402365
O  -2.067057 1.791669 -1.402424
C  0.258126 0.692581 0.000008
C  0.433513 -0.711054 -0.000049
C  -1.996645 -0.779666 -0.00011
C  -0.838611 -1.475268 -0.000061
C  1.301054 1.615079 0.000036
C  1.7526 -1.213213 -0.000086
C  2.622481 1.09243 0.000002
C  2.838217 -0.304932 -0.000055
H  -3.041694 -1.081677 -0.00015
H  1.117887 2.693482 0.000063
H  1.925795 -2.293792 -0.000125
H  3.474634 1.779197 0.00002
H  3.861599 -0.693053 -0.000069
