program: Gaussian 09
title: 000097594
version: EM64L-G09RevD.01
frameworkgroup: C1[X(C15H12Br2O)]
method: RPBEPBE
basis: SDD
operation: Freq
keyword: #p
keyword: freq=noraman
keyword: PBEPBE/SDD
title: #p freq=noraman PBEPBE/SDD
converged: YES YES NO NO
title: Mulliken charges:
elementType: Br Br O C C C C C C C C C C C C C C C H H H H H H H H H H H H
charge: 0.028895 0.030269 -0.124718 -0.812081 -0.814313 0.345161 0.564198 0.561706 -0.413548 -0.411250 -0.330948 -0.329824 -0.218705 -0.219163 -0.219371 -0.219527 -0.232561 -0.232785 0.312845 0.312346 0.237110 0.237387 0.269483 0.267188 0.234083 0.234165 0.235961 0.236024 0.235964 0.236008
chargesum: 0.00000
title: Mulliken charges with hydrogens summed into heavy atoms:
elementType: Br Br O C C C C C C C C C C C C C C C
charge: 0.028895 0.030269 -0.124718 -0.499236 -0.501967 0.345161 0.564198 0.561706 -0.176439 -0.173863 -0.061465 -0.062635 0.015378 0.015002 0.016591 0.016497 0.003403 0.003223
polarizability: 2.08106833e+02 4.56617853e+01 1.95343062e+02 3.26890397e-01 -2.14702644e-01 1.84505463e+02
1716.lowfreq: -4.5833 -0.0003 -0.0002 0.0003 4.4882 7.0200 14.9204 16.2134 36.2232
frequency: 14.6394 16.0997 36.1165 38.8397 57.5394 82.6154 98.6774 130.2965 134.9354 172.4504 189.7520 228.7367 231.0157 297.5714 336.6716 401.8680 402.2233 446.1231 488.4954 492.9855 556.6203 566.3604 608.6272 613.2652 658.1427 696.8317 700.8629 706.0353 759.6016 781.3754 782.0307 785.7601 847.4465 853.4999 854.3429 884.0717 931.3942 936.4224 982.4923 983.1379 988.5627 990.0271 1002.3766 1003.7701 1013.8264 1027.3018 1027.3507 1083.8458 1085.7491 1174.5655 1175.0413 1178.7103 1180.9151 1188.6625 1190.6674 1196.2000 1197.2923 1228.5965 1273.0948 1334.7211 1336.2092 1385.5716 1385.8819 1443.1031 1443.1992 1479.7862 1480.2363 1589.6684 1590.2025 1606.4831 1606.8715 1657.7021 3061.6551 3067.6759 3122.7414 3123.0753 3134.2039 3134.3266 3144.3870 3144.8622 3155.2474 3155.5686 3169.8985 3169.9910
redmass: 8.7926 7.3582 4.0122 4.1787 7.3442 7.9897 14.7980 9.8734 6.0294 8.8622 6.7809 5.4769 5.8168 7.5620 5.4698 2.8033 2.8029 4.7259 3.6650 7.7050 6.7780 4.5271 6.3333 6.4487 6.0426 3.2898 1.7157 1.7900 3.7041 2.8280 4.0121 2.3374 4.7667 1.2572 1.2486 4.6542 1.4285 1.4866 1.4048 1.3923 5.7986 6.1001 1.4198 1.3383 2.7509 2.2252 2.2192 1.6194 1.6179 1.0896 1.0728 1.1401 1.1437 1.4886 1.3842 1.3085 1.7707 1.7460 1.7493 1.2649 1.2773 8.1839 7.9810 2.1962 2.1951 2.2067 2.2088 6.0126 5.9775 5.9037 5.9185 10.3907 1.0856 1.0857 1.0879 1.0878 1.0869 1.0869 1.0917 1.0917 1.0964 1.0964 1.1016 1.1016
irintensity: 0.3300 0.3980 0.0871 0.0675 0.0883 0.5933 0.0188 4.3812 0.0400 0.5207 1.0563 3.6312 1.0963 0.4351 0.0684 0.3508 0.2210 6.5402 1.9258 35.5942 5.0336 128.8539 2.8077 0.0092 20.9014 1.5529 113.4792 21.6616 36.1286 24.9804 6.7198 1.0359 15.1050 0.2318 0.0451 0.0052 0.3950 0.2754 0.4322 0.0405 9.6837 0.4373 4.3521 0.0287 40.9160 4.7824 10.2496 14.2059 4.1709 4.8493 0.8597 14.5262 12.7738 11.4533 32.6829 2.1846 19.9787 11.1536 22.5578 0.8728 8.1704 0.9522 1.4527 20.9101 5.1650 10.2492 5.5368 2.6678 0.7025 0.9481 1.3440 62.7275 15.2304 4.0319 8.6656 1.2948 0.2906 0.1764 11.6697 11.0911 16.1180 21.9250 41.0071 3.5227
temp: 298.150 k
press: 1.00000 atm
elementType: 35 35 8 6 6 6 6 6 6 6 6 6 6 6 6 6 6 6 1 1 1 1 1 1 1 1 1 1 1 1
symmnumber: 1
zpe: 585666.5 jmol-1
zpe.correction: 0.223069 hartree
zpe.thermalcorrener: 0.239926 hartree
zpe.thermalcorrenthalpy: 0.240871 hartree
zpe.thermalcorrgfe: 0.172951 hartree
zpe.sumelectzpe: -679.665092 hartree
zpe.sumelectthermal: -679.648234 hartree
zpe.sumelectthermalent: -679.647290 hartree
zpe.sumelectthermalfe: -679.715210 hartree
dipole: 0.0420 -0.1107 4.7519
dipole: 4.7534
quadrupole: -107.7522 -127.8127 -117.4365
quadrupole: 17.0551 0.0674 0.1376
quadrupole: 9.9149 -10.1455 0.2306 17.0551 0.0674 0.1376
hfenergy: -679.8881604 hartree
pointgroup: C01 [X(C15H12Br2O1)]
dipole: 0.0072159 0.1990117 -1.8594805 debye
polarizability: 226.8060354|-38.535474|176.7441791|-3.4282467|-0.9284648|184.4051429 unknown
InChI: InChI=1S/C15H12Br2O/c16-13(11-7-3-1-4-8-11)15(18)14(17)12-9-5-2-6-10-12/h1-10,13-14H
charge 0 multiplicity 1
30 atoms
Br 0.966549 2.622089 1.517686
Br -1.056725 -2.906926 1.010756
O  0.029734 -0.282707 2.395799
C  0.789657 0.928578 0.380505
C  -0.817166 -1.043217 0.201221
C  0.00237 -0.149378 1.157431
C  2.145973 0.417937 -0.057606
C  -2.153833 -0.417975 -0.137362
C  2.588262 0.661852 -1.383835
C  -2.607523 -0.421826 -1.482052
C  2.979802 -0.306581 0.835238
C  -2.958973 0.177127 0.869949
C  3.846258 0.187377 -1.814045
C  -3.848229 0.161998 -1.817226
C  4.23675 -0.777606 0.402523
C  -4.1982 0.759477 0.531671
C  4.672828 -0.534493 -0.921772
C  -4.645715 0.755216 -0.810904
H  0.201585 1.274299 -0.485222
H  -0.236464 -1.244339 -0.714286
H  1.953341 1.233354 -2.072027
H  -1.995311 -0.893567 -2.260516
H  2.64774 -0.485631 1.863779
H  -2.620242 0.169498 1.911873
H  4.182192 0.382549 -2.838175
H  -4.193272 0.151311 -2.856765
H  4.875873 -1.334316 1.096134
H  -4.814611 1.216691 1.312982
H  5.649481 -0.902516 -1.254684
H  -5.608832 1.208126 -1.070466
