program: Gaussian 09
title: 000097569
version: EM64L-G09RevD.01
frameworkgroup: C1[X(C10H11ClO3)]
method: RPBEPBE
basis: SDD
operation: Freq
keyword: #p
keyword: freq=noraman
keyword: PBEPBE/SDD
title: #p freq=noraman PBEPBE/SDD
converged: YES YES NO NO
title: Mulliken charges:
elementType: Cl O O O C C C C C C C C C C H H H H H H H H H H H
charge: -0.032660 -0.287720 -0.215011 -0.126510 0.020510 0.332007 -0.685301 -0.689209 0.204067 -0.340677 -0.325702 -0.231566 -0.229951 0.063052 0.196538 0.213562 0.240925 0.247685 0.206265 0.236595 0.233351 0.244077 0.258436 0.230265 0.236975
chargesum: 0.00000
title: Mulliken charges with hydrogens summed into heavy atoms:
elementType: Cl O O O C C C C C C C C C C
charge: -0.032660 -0.287720 -0.215011 -0.126510 0.217048 0.332007 0.016870 -0.012998 0.204067 -0.096600 -0.067266 -0.001302 0.007023 0.063052
polarizability: 1.58392607e+02 1.21119187e+01 1.45447145e+02 -9.41978185e+00 9.20357061e-01 7.85961836e+01
1716.lowfreq: -7.2243 -4.9953 -2.8732 0.0023 0.0025 0.0028 40.1665 45.4197 56.1408
frequency: 40.1328 45.3945 56.1263 82.2366 99.3365 144.9220 184.7355 190.3242 226.3755 239.8953 263.5067 294.8098 334.6403 381.7395 420.0365 441.5639 457.2417 490.8393 535.1450 558.3760 592.6146 601.8498 703.9991 729.2362 749.6160 773.8048 780.7413 846.5814 857.0217 919.5384 929.0587 934.1728 945.0563 972.3221 1017.8584 1036.2270 1081.8968 1101.9212 1151.7740 1155.6456 1170.1193 1184.9698 1238.9045 1266.0355 1317.4382 1344.5586 1381.9466 1386.6566 1401.5012 1441.0195 1455.9175 1467.6338 1469.6878 1477.6593 1489.4740 1582.3816 1615.5501 1713.5196 2976.9394 2992.4321 2997.2432 3088.0386 3096.7216 3101.2798 3106.2367 3139.6858 3157.1098 3166.5295 3180.3818
redmass: 4.9063 9.2417 3.5418 5.2769 4.6722 3.8361 1.0347 4.9494 1.5519 3.1497 4.4149 4.9973 3.4550 3.0757 12.6782 2.9501 3.4136 4.5086 4.8979 5.1700 6.8155 11.5326 4.3426 4.0477 1.5633 5.5372 3.6047 1.5214 3.3080 3.2540 1.2976 1.3701 1.3344 1.3107 10.0514 2.0656 3.2827 1.7500 1.8824 1.9234 1.1147 1.9939 3.0547 1.5131 1.2959 1.4235 4.8217 1.3553 1.2228 2.5009 1.0515 1.0782 1.0470 2.5799 1.0601 6.8269 7.4878 13.0386 1.0844 1.0361 1.0363 1.0992 1.1000 1.1004 1.1004 1.0862 1.0896 1.0947 1.1004
irintensity: 1.7900 1.1716 0.4264 0.7346 0.6429 0.0318 0.0925 0.4496 0.1390 2.2874 1.6902 3.2838 4.1503 3.4086 4.2238 12.1733 6.2761 1.2662 8.3794 27.3844 6.1979 9.8026 20.2231 7.1233 85.7143 8.6691 78.6729 3.2697 27.5823 51.8659 8.2417 5.9507 0.6440 0.0386 461.5470 102.9197 99.6471 96.4789 15.8426 18.9372 10.3715 38.9517 203.4125 17.2779 9.9301 4.4559 21.7675 31.8739 33.4235 9.7255 4.3146 5.5592 6.4910 136.6135 15.5242 4.4829 32.6615 298.2893 33.5788 13.2806 17.4129 21.5514 22.9106 23.9779 31.3578 3.8168 10.5613 14.8572 9.2483
temp: 298.150 k
press: 1.00000 atm
elementType: 17 8 8 8 6 6 6 6 6 6 6 6 6 6 1 1 1 1 1 1 1 1 1 1 1
symmnumber: 1
zpe: 495109.7 jmol-1
zpe.correction: 0.188577 hartree
zpe.thermalcorrener: 0.202776 hartree
zpe.thermalcorrenthalpy: 0.203720 hartree
zpe.thermalcorrgfe: 0.146253 hartree
zpe.sumelectzpe: -1072.337189 hartree
zpe.sumelectthermal: -1072.322990 hartree
zpe.sumelectthermalent: -1072.322046 hartree
zpe.sumelectthermalfe: -1072.379513 hartree
dipole: -4.2884 1.1148 -0.3116
dipole: 4.4419
quadrupole: -86.1021 -74.3990 -95.1744
quadrupole: -0.7985 -1.2917 -1.9448
quadrupole: -0.8769 10.8262 -9.9492 -0.7985 -1.2917 -1.9448
hfenergy: -1072.525766 hartree
pointgroup: C01 [X(C10H11Cl1O3)]
dipole: -1.4068263 1.0264441 0.1456701 debye
dipolederiv: -0.4544392 0.4247554 -0.1672168 0.4669406 -0.6587887 0.1548465 -0.2259229 0.2203313 -0.2236957 -0.9480302 -0.679184 0.0248274 -0.8177223 -1.200373 0.1224386 0.1681456 0.2075242 -0.3477666 -0.487351 0.3769417 -0.0653828 0.6557247 -1.5609319 -0.2667955 0.0679222 -0.40119 -0.4395175 -0.4973605 0.0712938 -0.3671574 0.2166227 -0.589458 -0.0353827 -0.2687927 -0.1551845 -0.8505839 0.9519508 0.5465364 -0.0149908 0.3001053 0.5029443 0.0148998 0.0420577 0.0159753 0.4338363 0.2677984 0.4628144 -0.0721399 0.825183 1.0303196 -0.1396618 -0.1999795 -0.1927983 0.1273021 -0.0646487 -0.1137122 -0.0113246 -0.0205064 -0.0245985 0.0103958 -0.0923284 0.0029565 -0.1926765 0.0085484 -0.06496 -0.0065913 -0.0609943 -0.0929621 0.0655658 -0.0048557 0.0642381 -0.0150263 0.3344654 -0.7415032 -0.0358751 -0.404458 0.6048425 0.0404853 0.0156151 -0.1005051 -0.0051323 0.02367 0.148866 0.0050173 -0.2703434 -0.3048299 0.0246139 0.0475833 0.0453495 -0.1863357 -0.001743 0.0719513 0.0118997 -0.0093598 0.0139147 -0.0399888 0.0134895 -0.0372181 -0.1002027 0.1755284 -0.0832063 -0.0040602 0.0800521 0.0975401 -0.0459321 -0.0133545 -0.0431366 -0.1313139 -0.1743042 0.0956237 -0.0012227 0.0552518 -0.058775 -0.0330485 0.0008654 -0.0276971 -0.1880575 0.9994078 -0.5640195 0.6164036 -1.0856342 2.1206823 0.152966 0.3758365 0.4229342 1.3304683 -0.0904352 -0.0043936 0.0427523 0.1001275 -0.0931298 -0.091057 0.0283835 -0.0774545 -0.0312062 -0.1571008 -0.0895985 -0.0400414 -0.074537 0.082792 -0.0162997 -0.0303127 -0.0372859 0.0878716 0.1208202 -0.0142109 0.0287329 -0.0219861 -0.0846024 0.1091339 0.0441689 0.091402 0.028094 0.0573847 0.1034337 0.0630169 0.0772455 0.0028806 -0.0656273 0.0261968 -0.0275388 0.0502395 -0.1419313 -0.0937281 -0.007274 -0.0619769 0.044896 0.0124424 -0.033041 0.0014562 0.104553 0.1079633 0.0240549 -0.0713856 0.0022469 0.0823155 -0.0125636 -0.0432806 0.0120553 -0.1278096 0.0445634 0.1180144 0.0555205 0.0607023 0.0000514 -0.0362769 0.0727167 -0.0767073 0.0342839 -0.0938116 -0.0265549 0.0087093 -0.0263865 0.0998447 0.0095541 0.0096569 0.0159923 0.1532445 -0.0481519 -0.0028063 0.0057552 -0.0031845 0.1184482 0.0142 0.0062897 0.0129205 0.1657487 0.0199537 0.1036706 -0.009619 0.0812848 -0.0523625 0.0225892 -0.0141568 0.0263662 0.1564063 0.0472532 -0.0700787 0.0116465 -0.0643978 -0.0806599 0.0285027 0.0070968 0.0372145 0.1672761 unknown
polarizability: 139.1306307|-4.1333944|164.7899202|5.0019984|-8.0956845|78.5153852 unknown
InChI: InChI=1S/C10H11ClO3/c1-7(2)13-8-5-3-4-6-9(8)14-10(11)12/h3-7H,1-2H3
charge 0 multiplicity 1
25 atoms
Cl 2.752488 -2.79938 0.279317
O  -0.966822 -0.709654 0.641699
O  1.755696 -0.402679 0.5186
O  1.027445 -1.542161 -1.41897
C  -2.413988 -1.046662 0.449708
C  -0.516005 0.57957 0.381352
C  -2.749254 -1.073252 -1.050161
C  -2.584375 -2.404805 1.134445
C  0.894389 0.738422 0.306456
C  -1.320078 1.736933 0.227867
C  1.501738 1.988293 0.131575
C  -0.717005 3.00095 0.039543
C  0.688173 3.137355 -0.003148
C  1.661202 -1.451536 -0.372714
H  -3.019053 -0.282081 0.979596
H  -3.809412 -1.350467 -1.194532
H  -2.581129 -0.093109 -1.528562
H  -2.115434 -1.817243 -1.562518
H  -3.63793 -2.731067 1.071754
H  -2.295289 -2.34556 2.197263
H  -1.951168 -3.163189 0.642455
H  -2.410491 1.661613 0.267041
H  2.593722 2.049558 0.100452
H  -1.355169 3.884138 -0.071268
H  1.149048 4.119412 -0.143952
