program: Gaussian 09
title: 000097550
version: EM64L-G09RevD.01
frameworkgroup: C1[X(C8H7N3O2)]
method: RPBEPBE
basis: SDD
operation: Freq
keyword: #pfreq=noraman
keyword: PBEPBE/SDD
title: #p freq=noraman PBEPBE/SDD
converged: NO YES NO NO
title: Mulliken charges:
elementType: O O N N N C C C C C C C C H H H H H H H
charge: -0.214224 -0.219010 -0.070748 -0.061909 0.014093 0.329341 0.002413 -0.322054 -0.513607 -0.274512 0.402390 -0.359877 -0.587164 0.280416 0.296254 0.258175 0.285618 0.227072 0.263653 0.263681
chargesum: 0.00000
title: Mulliken charges with hydrogens summed into heavy atoms:
elementType: O O N N N C C C C C C C C
charge: -0.214224 -0.219010 -0.070748 -0.061909 0.014093 0.329341 0.002413 -0.041638 -0.217352 -0.016337 0.402390 -0.074259 0.167242
polarizability: 2.05081302e+02 6.58853937e+00 1.20732458e+02 -1.90630900e-02 -1.62417533e-03 4.90003176e+01
1716.lowfreq: -9.5872 -0.0008 -0.0005 0.0007 8.4886 9.1702 21.8293 62.6898 88.9143
frequency: 19.2547 62.6829 88.9132 174.0631 174.8436 276.2322 286.3892 325.4561 328.9983 434.6911 446.8406 525.3182 543.9344 566.8681 612.5161 663.7716 671.7638 698.6806 754.0716 768.1425 790.9875 833.8452 841.2530 930.9169 932.2743 951.9731 988.3918 1047.9319 1059.8091 1125.1013 1129.6761 1149.2083 1206.9526 1233.8703 1258.9196 1305.9069 1314.7453 1363.7758 1398.5995 1401.8572 1448.3137 1455.2389 1483.3494 1502.2538 1512.2987 1558.4010 1635.5647 3016.2080 3112.6735 3133.8703 3167.0927 3176.8457 3193.1562 3239.2689
redmass: 1.0559 9.9124 5.2772 4.4338 6.1041 3.8085 4.1045 6.3381 9.7340 2.9261 4.8697 5.8852 5.5537 4.6384 4.2307 8.2201 5.5625 4.3076 2.1115 9.2191 2.0275 4.4419 1.6868 4.0664 1.5380 7.0048 1.3092 1.8332 2.1707 1.3423 1.3199 1.8631 8.3689 2.0190 2.3849 2.6605 3.9246 11.0145 3.4638 2.4009 1.4828 1.0406 1.3725 4.3162 3.5624 8.2643 7.9179 1.0332 1.1022 1.1026 1.0894 1.0931 1.0964 1.0998
irintensity: 0.1682 0.1156 0.4249 13.9507 1.0091 0.6614 5.8158 0.4906 0.8603 8.8619 1.1431 4.2579 1.2331 0.2856 6.6511 15.2964 1.4121 9.2641 21.5538 12.1849 21.3994 9.4450 35.0646 2.4267 31.5157 3.2398 0.7893 46.1511 15.7153 2.3263 27.1746 42.8439 373.4859 5.4474 58.1804 7.4679 36.7051 87.7540 48.0673 14.9560 19.0816 17.7542 15.2348 0.7692 4.8698 0.8862 74.0608 31.8010 9.6256 7.8389 3.2558 1.7953 3.5845 0.7263
temp: 298.150 k
press: 1.00000 atm
elementType: 8 8 7 7 7 6 6 6 6 6 6 6 6 1 1 1 1 1 1 1
symmnumber: 1
zpe: 378761.4 jmol-1
zpe.correction: 0.144263 hartree
zpe.thermalcorrener: 0.154893 hartree
zpe.thermalcorrenthalpy: 0.155837 hartree
zpe.thermalcorrgfe: 0.106176 hartree
zpe.sumelectzpe: -622.734582 hartree
zpe.sumelectthermal: -622.723951 hartree
zpe.sumelectthermalent: -622.723007 hartree
zpe.sumelectthermalfe: -622.772668 hartree
dipole: -7.6138 -1.3494 0.0033
dipole: 7.7325
quadrupole: -78.8348 -70.8071 -75.8487
quadrupole: 12.6459 0.0102 -0.0022
quadrupole: -3.6713 4.3565 -0.6852 12.6459 0.0102 -0.0022
hfenergy: -622.8788445 hartree
pointgroup: C01 [X(C8H7N3O2)]
dipole: 2.9817369 -0.6034757 -0.0012825 debye
dipolederiv: -0.9231088 0.2192575 -0.0000574 0.2547619 -0.6023362 0.000288 0.0007319 -0.0004559 -0.2347324 -0.7227356 -0.1713043 0.0000847 -0.4261994 -0.7425111 -0.000314 0.0006396 0.0006174 -0.2367439 -0.6148281 0.0956541 0.0000787 -0.2367385 0.3027831 0.000068 -0.0004128 0.00009 -0.0666586 -0.6546373 0.1569692 0.0000155 -0.0681 -0.2778756 -0.0000009 -0.0000132 0.0000063 -0.1888582 2.1207779 0.0049612 -0.000343 0.2990083 1.0795888 -0.0000439 -0.0008584 -0.0000864 0.1831153 -0.5782509 -0.0029167 0.0000881 -0.1807967 -0.1643381 -0.0000579 0.0000398 -0.0000254 0.0291093 0.4175818 -0.1371667 0.0000122 0.1719416 -0.0052629 -0.0000016 0.0000222 -0.0000235 0.0127157 0.5513726 -0.171799 -0.0000643 0.1605631 -0.1203127 0.0000051 0.0001643 0.0000164 -0.1621764 0.7044659 -0.0149157 -0.0000512 -0.2218053 -0.0363115 0.0000711 -0.0003372 -0.0000427 -0.1012233 -0.1352184 0.037432 0.0000263 0.0031845 0.1454653 0.0000307 -0.0000969 0.0000441 -0.127673 -1.038022 0.0293326 0.0002825 0.1386643 0.0381 0.0000242 -0.0000207 -0.0000485 0.0431979 0.0030976 -0.0528656 0.0000246 0.1814371 0.0206834 -0.0000279 -0.0002127 0.0000283 -0.1425058 0.5237037 -0.0303746 -0.00016 -0.1114615 0.1633935 -0.0000556 0.0001862 -0.0000967 0.1628758 0.0769622 0.0334271 -0.0000107 0.0333328 0.0270868 -0.0000072 -0.0000046 -0.0000109 0.2179421 0.1040484 -0.0193548 -0.000015 -0.0186513 0.0501502 -0.0000188 -0.000006 0.0000066 0.177815 0.0735798 -0.0500045 0.0000059 -0.0151956 -0.0375871 -0.0000141 0.0000784 -0.000032 0.1618869 0.0811584 0.0815566 -0.0000194 0.0154154 0.0830068 0.0000036 0.0000288 -0.0000206 0.1749543 0.0443426 -0.033353 0.0000479 0.0791301 -0.0909881 0.0002428 -0.0000636 0.000206 0.1305843 -0.0172896 0.0127662 0.028949 -0.0290962 0.0837364 0.0819261 0.0961539 0.0540589 -0.017023 -0.0170001 0.0126983 -0.0288944 -0.0293945 0.0835288 -0.0821178 -0.096019 -0.0542314 -0.0166021 unknown
polarizability: 204.7117916|-8.6278689|121.101969|-0.019018|0.0020865|49.0003176 unknown
InChI: InChI=1S/C8H7N3O2/c1-10-5-6-4-7(11(12)13)2-3-8(6)9-10/h2-5H,1H3
charge 0 multiplicity 1
20 atoms
O  -3.906854 0.650283 0.00101
O  -3.3656 -1.565877 0.000893
N  2.921112 -0.371279 -0.000131
N  2.453724 0.943544 0.000004
N  -3.042277 -0.312222 -0.000503
C  0.700662 -0.617025 -0.000227
C  1.08197 0.789364 -0.0001
C  1.930901 -1.324264 -0.00016
C  -0.667041 -0.993606 -0.00035
C  0.089248 1.81566 -0.000083
C  -1.606526 0.043989 -0.000355
C  -1.251735 1.438427 -0.000196
C  4.372258 -0.585107 -0.000255
H  2.149363 -2.388927 -0.000192
H  -1.004254 -2.033423 -0.00045
H  0.388049 2.867671 0.000013
H  -2.058327 2.175156 -0.0002
H  4.584292 -1.66492 0.000844
H  4.814368 -0.121023 -0.896485
H  4.814668 -0.119122 0.894823
